program: Gaussian 09
title: 000290066
version: EM64L-G09RevD.01
frameworkgroup: C1[X(C15H21NO)]
method: RPBEPBE
basis: SDD
operation: Freq
keyword: #p
keyword: freq=noraman
keyword: PBEPBE/SDD
title: #p freq=noraman PBEPBE/SDD
converged: NO YES NO NO
title: Mulliken charges:
elementType: O N C C C C C C C C C C C C C C C H H H H H H H H H H H H H H H H H H H H H
charge: -0.455161 -0.417723 -0.140575 -0.115170 -0.254542 -0.501191 -0.190451 -0.140318 -0.474272 -0.467133 0.455262 -0.438238 -0.377985 -0.636735 -0.230647 -0.257511 -0.247087 0.238028 0.235851 0.220071 0.207180 0.248351 0.213320 0.195494 0.221744 0.217031 0.199366 0.224541 0.295985 0.361497 0.237031 0.221174 0.227780 0.243689 0.202813 0.225126 0.224306 0.229097
chargesum: 0.00000
title: Mulliken charges with hydrogens summed into heavy atoms:
elementType: O N C C C C C C C C C C C C C C C
charge: -0.093664 -0.121737 0.097453 0.120682 -0.034471 -0.045660 0.022869 0.055176 -0.035497 -0.043226 0.455262 -0.201207 -0.156812 0.037547 -0.005521 -0.033205 -0.017989
polarizability: 1.98980193e+02 -2.79065299e+00 1.36816630e+02 -5.13769728e-02 7.89677759e+00 1.47638708e+02
1716.lowfreq: -13.8894 0.0003 0.0007 0.0009 11.3190 16.0160 30.5736 57.3772 74.6430
frequency: 30.1680 56.9956 74.5712 95.8865 121.5522 160.9137 184.2063 204.7989 226.2921 242.6045 284.4739 297.0487 309.7873 355.8477 398.7471 403.1942 439.7099 501.7422 515.5562 534.4012 599.0846 617.7665 654.1095 707.1094 710.8337 728.6206 744.6472 759.3594 769.3810 787.1593 836.1299 847.3332 854.6118 865.3290 889.9009 896.2409 922.1087 956.9106 961.0753 976.6470 981.1935 989.6464 995.1315 1004.3710 1016.4037 1028.7553 1036.4586 1047.0201 1073.4500 1080.4223 1085.8982 1110.8355 1130.4728 1147.3884 1163.7215 1170.9273 1172.7445 1189.4219 1192.9869 1194.1114 1211.6723 1226.0554 1231.7947 1269.6803 1279.1136 1284.6584 1291.3283 1302.3594 1313.1741 1316.9411 1327.0891 1337.8353 1343.8003 1369.7462 1384.2057 1404.5045 1437.3310 1439.6433 1448.2445 1464.2378 1472.4982 1473.1341 1481.9724 1490.2030 1492.8093 1588.5803 1611.2480 2899.8093 2911.6246 2923.1659 2967.5483 2989.6907 2996.5516 3004.5084 3028.2358 3035.1976 3038.0109 3046.9896 3066.6320 3077.8571 3085.9012 3112.2441 3118.5531 3132.9489 3142.5430 3161.7770 3196.6631 3451.3806
redmass: 3.6866 4.3130 3.2751 3.5096 2.5739 3.2931 1.3216 2.7158 3.2006 3.6707 3.0218 3.3007 3.3795 2.7416 3.6758 2.8574 2.7836 3.3095 2.8026 3.1770 4.8590 6.0380 2.6032 1.7748 2.0088 3.3365 2.5392 1.3000 1.7263 1.6387 2.9791 2.6230 1.2602 3.5354 2.6911 2.1951 1.5429 2.3535 1.9047 1.4208 1.9186 5.9622 1.3147 2.3878 2.2950 2.1944 2.5913 1.9185 1.7054 1.4570 1.5962 1.4652 2.8233 1.2872 1.2995 1.4827 1.2362 1.3649 1.5274 1.5167 1.6300 1.3831 1.3939 1.4015 1.3019 1.4266 1.4171 1.5175 1.3644 1.3907 1.2894 1.3247 1.5534 1.6922 3.6208 1.5340 1.1889 2.0412 1.2443 1.0932 1.0555 1.0864 2.1636 1.0993 1.0535 5.8618 6.0936 1.0817 1.0533 1.0816 1.0828 1.0598 1.0641 1.0647 1.0848 1.0813 1.0987 1.0919 1.1026 1.1012 1.1008 1.0872 1.0857 1.0906 1.0957 1.1013 1.0633 1.0750
irintensity: 0.0921 0.8459 2.0991 0.5605 1.0116 1.9986 0.3514 0.8237 6.5120 0.3931 1.2659 6.3617 5.7809 3.2549 4.9596 0.5371 7.4163 4.5382 7.0205 7.8065 3.2260 0.9340 32.8417 52.6559 50.6634 20.6932 26.6389 49.5014 31.4277 2.9910 6.0445 4.1370 0.4845 1.3268 14.9977 7.2158 1.5215 5.5958 2.8883 0.1954 1.5684 0.3103 0.0632 7.2072 35.8410 10.2972 28.6436 8.6296 0.2301 8.4225 1.3933 0.9524 41.4096 2.1817 2.1208 3.2139 2.5053 7.8471 5.8175 2.9330 4.8190 12.5171 6.7799 1.1417 0.7413 4.8664 9.1319 1.1068 6.5955 10.9099 35.9896 3.7269 1.6942 3.0203 2.8742 67.1652 18.0684 6.4093 20.9455 16.3104 8.7888 1.6512 23.1484 21.6401 8.0114 1.9056 10.1366 51.4394 63.1166 94.1651 25.3983 33.5261 33.6528 52.4091 64.4005 40.6816 3.8173 33.5107 77.6509 23.2701 24.4926 8.4709 4.8131 10.1879 43.6860 26.1579 124.8796 2.0749
temp: 298.150 k
press: 1.00000 atm
elementType: 8 7 6 6 6 6 6 6 6 6 6 6 6 6 6 6 6 1 1 1 1 1 1 1 1 1 1 1 1 1 1 1 1 1 1 1 1 1
symmnumber: 1
zpe: 867387.8 jmol-1
zpe.correction: 0.330371 hartree
zpe.thermalcorrener: 0.345497 hartree
zpe.thermalcorrenthalpy: 0.346441 hartree
zpe.thermalcorrgfe: 0.288003 hartree
zpe.sumelectzpe: -712.868898 hartree
zpe.sumelectthermal: -712.853771 hartree
zpe.sumelectthermalent: -712.852827 hartree
zpe.sumelectthermalfe: -712.911265 hartree
dipole: -2.5282 0.3583 1.8194
dipole: 3.1353
quadrupole: -107.3135 -99.2725 -100.8150
quadrupole: -3.7153 7.2426 4.2568
quadrupole: -4.8465 3.1945 1.6520 -3.7153 7.2426 4.2568
hfenergy: -713.1992683 hartree
pointgroup: C01 [X(C15H21N1O1)]
dipole: -0.9737827 0.1492849 0.74234 debye
polarizability: 198.5696147|-5.5491144|136.411976|-0.88612|7.4009217|148.4539401 unknown
InChI: InChI=1S/C15H21NO/c1-16-14-13(10-5-3-2-4-6-10)11-7-8-12(9-11)15(14)17/h2-6,11-17H,7-9H2,1H3
charge 0 multiplicity 1
38 atoms
O  2.925847 1.091763 -1.275592
N  0.782767 2.212881 -0.164501
C  0.60546 -1.629481 -0.457498
C  2.861521 -1.00915 0.013931
C  0.108346 -0.142534 -0.567159
C  2.022998 -1.711262 -1.080207
C  1.028673 0.803388 0.250739
C  2.548675 0.503132 0.008907
C  0.856359 -2.08958 1.012678
C  2.338937 -1.672367 1.327121
C  -1.379705 -0.003307 -0.233076
C  -2.333143 -0.211055 -1.26656
C  -1.867736 0.275739 1.071574
C  1.171543 3.244199 0.823496
C  -3.720325 -0.152179 -1.011351
C  -3.255623 0.338604 1.332987
C  -4.189316 0.122577 0.29452
H  -0.128823 -2.278897 -0.967819
H  3.948643 -1.142961 -0.125328
H  0.234355 0.134295 -1.63566
H  2.340828 -2.764921 -1.199511
H  2.108512 -1.200183 -2.054091
H  0.828809 0.666262 1.337377
H  3.132236 0.987854 0.825422
H  0.742093 -3.186982 1.07989
H  0.127584 -1.653068 1.719402
H  2.410214 -0.986745 2.193164
H  2.949174 -2.560137 1.572917
H  -0.185776 2.339254 -0.487171
H  2.273617 1.861697 -1.361493
H  -1.977315 -0.418953 -2.284032
H  -1.165869 0.454874 1.894267
H  0.922125 4.244716 0.429628
H  2.262956 3.214222 0.987921
H  0.673097 3.119095 1.81209
H  -4.43326 -0.314434 -1.827828
H  -3.6076 0.557034 2.347853
H  -5.264879 0.172114 0.497596
