program: Gaussian 09
title: 000290064
version: EM64L-G09RevD.01
frameworkgroup: C1[X(C15H19NO)]
method: RPBEPBE
basis: SDD
operation: Freq
keyword: #p
keyword: freq=noraman
keyword: PBEPBE/SDD
title: #p freq=noraman PBEPBE/SDD
converged: YES YES NO NO
title: Mulliken charges:
elementType: O N C C C C C C C C C C C C C C C H H H H H H H H H H H H H H H H H H H
charge: -0.205452 -0.326691 -0.141621 -0.231983 -0.266460 -0.513595 -0.484312 -0.470558 -0.243587 0.119433 0.503057 -0.442213 -0.431147 -0.650566 -0.233751 -0.270504 -0.242041 0.247306 0.260551 0.239721 0.272276 0.223913 0.231507 0.215553 0.221918 0.232409 0.245683 0.285813 0.231481 0.278802 0.220061 0.232957 0.209576 0.224401 0.229003 0.229059
chargesum: 0.00000
title: Mulliken charges with hydrogens summed into heavy atoms:
elementType: O N C C C C C C C C C C C C C C C
charge: -0.205452 -0.040878 0.105685 0.028567 -0.026739 -0.017405 -0.037252 -0.016231 0.002096 0.119433 0.503057 -0.210731 -0.152346 0.012029 -0.009350 -0.041501 -0.012982
polarizability: 1.92289605e+02 -3.19089941e-01 1.43839377e+02 3.61434100e+00 1.53068836e+01 1.41269254e+02
1716.lowfreq: -21.0624 -18.6873 -5.1751 -0.0009 -0.0009 -0.0006 43.7462 75.5992 86.0891
frequency: 43.3944 75.5902 86.0547 91.5726 106.0668 138.3194 161.1638 197.7148 227.1233 239.3733 270.9285 278.7369 326.9565 348.9518 391.6003 406.5601 438.9750 492.2268 531.9388 550.2765 596.0861 614.0346 629.6942 674.4965 709.8894 714.2888 737.9565 765.8301 781.2960 793.5192 840.4367 857.8110 865.9984 889.0114 907.9075 923.3016 940.4159 958.4012 972.6758 980.4852 989.7532 996.8478 1009.3580 1016.9544 1032.6642 1052.8254 1062.0209 1075.5403 1087.0692 1114.8141 1126.7892 1139.0498 1155.6134 1172.6336 1182.7789 1196.9396 1199.5133 1208.2012 1218.8132 1223.1960 1236.4744 1250.6172 1279.4447 1290.0268 1300.0414 1307.7499 1312.7527 1323.6669 1333.7063 1351.4926 1384.0231 1429.7434 1440.5802 1455.8294 1463.1749 1467.5885 1471.9860 1485.5190 1487.3622 1502.1358 1589.8306 1612.4967 1619.0043 2932.6147 2956.7780 2993.2586 2993.7813 3003.0094 3007.8862 3016.4877 3029.0543 3045.5449 3056.0044 3068.9679 3070.7082 3080.1935 3111.4240 3123.0249 3134.7920 3144.6428 3162.2404 3484.1095
redmass: 3.8338 3.2436 6.1457 2.5729 3.5438 3.1939 1.5125 2.2459 3.2494 2.6539 3.2038 3.5831 3.3317 2.8211 5.6587 2.8721 2.8652 3.4170 3.0200 3.5931 3.3212 6.0508 2.2261 3.3808 1.8741 5.4161 2.2999 2.9158 1.5267 2.8854 2.6978 1.2796 3.0740 2.4169 2.6708 1.4469 2.2061 2.1026 2.4599 1.3842 5.9323 1.3158 2.2012 2.1769 1.9502 1.8696 1.8381 1.7110 1.6004 1.3510 1.5837 1.7286 1.4537 1.0536 1.5103 1.1284 2.1579 1.6107 1.7644 1.4319 1.4266 1.8409 1.3411 1.6018 1.4298 1.6191 1.4835 1.4044 1.3530 1.4439 4.5652 1.1512 2.0794 1.1397 1.1188 1.0770 1.0953 2.2052 1.0941 1.0434 5.7948 5.9747 9.6974 1.0418 1.0801 1.0792 1.0651 1.0648 1.0625 1.0929 1.0873 1.1020 1.0898 1.0986 1.1025 1.1004 1.0873 1.0859 1.0912 1.0956 1.1014 1.0743
irintensity: 0.0312 0.4894 2.2513 4.1828 1.3388 1.6626 4.5195 0.1320 1.5222 3.3903 0.4349 10.2363 0.4565 0.3755 3.9202 0.0715 3.2729 18.7285 3.4555 16.9473 26.3156 3.4886 55.9350 8.8005 37.4707 3.4219 45.3884 12.7491 2.7385 9.6617 8.2051 0.4864 2.3619 6.6962 6.5908 2.8682 11.2820 4.4878 2.1543 0.1013 0.2799 0.0311 6.1655 10.6297 2.4081 10.0736 1.4507 6.2638 11.7451 3.5771 22.8765 15.6995 8.0362 0.1401 3.5413 0.2409 15.5207 4.6800 6.5803 3.3208 16.5625 1.9068 0.0306 2.6813 0.6777 1.2061 4.4239 2.3327 1.5820 0.1857 1.0321 0.8380 9.4042 32.7518 13.5308 7.3668 12.8758 17.2510 15.4062 16.5888 1.8461 7.8267 128.9734 92.7834 22.9559 7.1249 35.4140 27.9322 58.2206 44.3505 40.2805 6.5221 19.9212 52.9075 48.2556 21.0508 8.7255 0.2152 13.5632 30.2207 27.0491 1.5101
temp: 298.150 k
press: 1.00000 atm
elementType: 8 7 6 6 6 6 6 6 6 6 6 6 6 6 6 6 6 1 1 1 1 1 1 1 1 1 1 1 1 1 1 1 1 1 1 1
symmnumber: 1
zpe: 805255.5 jmol-1
zpe.correction: 0.306706 hartree
zpe.thermalcorrener: 0.321796 hartree
zpe.thermalcorrenthalpy: 0.322740 hartree
zpe.thermalcorrgfe: 0.264710 hartree
zpe.sumelectzpe: -711.689446 hartree
zpe.sumelectthermal: -711.674355 hartree
zpe.sumelectthermalent: -711.673411 hartree
zpe.sumelectthermalfe: -711.731442 hartree
dipole: -0.2729 -2.6168 -1.3382
dipole: 2.9518
quadrupole: -93.9182 -101.4272 -104.2400
quadrupole: 3.7598 4.9730 -0.4550
quadrupole: 5.9436 -1.5654 -4.3782 3.7598 4.9730 -0.4550
hfenergy: -711.9961513 hartree
pointgroup: C01 [X(C15H19N1O1)]
dipole: -0.1895669 -1.0875504 -0.3604783 debye
polarizability: 187.9981056|-7.4155732|150.0944444|14.8533903|12.0012628|139.305685 unknown
InChI: InChI=1S/C15H19NO/c1-16-14-13(10-5-3-2-4-6-10)11-7-8-12(9-11)15(14)17/h2-6,11-14,16H,7-9H2,1H3
charge 0 multiplicity 1
36 atoms
O  -1.550938 2.0306 1.00153
N  0.058291 1.910043 -1.406968
C  -0.854406 -1.720236 -0.358061
C  -2.397657 -0.257841 0.755683
C  0.046493 -0.565847 -0.92801
C  -1.350926 -1.376654 1.0688
C  -2.191531 -1.848497 -1.155493
C  -3.204043 -0.897558 -0.420858
C  -0.767125 0.780702 -0.984084
C  -1.591882 0.967991 0.322734
C  1.383287 -0.480235 -0.185687
C  2.458188 -1.289985 -0.638941
C  1.598194 0.33047 0.962013
C  -0.666726 3.104537 -1.885729
C  3.701451 -1.303757 0.029544
C  2.843797 0.324264 1.631121
C  3.899952 -0.494111 1.172118
H  -0.270284 -2.658273 -0.380411
H  -3.027588 0.013305 1.619831
H  0.276398 -0.815816 -1.982567
H  -0.547849 -1.054355 1.751811
H  -1.863133 -2.243567 1.527633
H  -2.551099 -2.892955 -1.126871
H  -2.058164 -1.584488 -2.221057
H  -3.64329 -0.138178 -1.092774
H  -4.045119 -1.477347 0.000625
H  -1.527546 0.627931 -1.779373
H  0.789328 2.136527 -0.723109
H  2.318247 -1.910112 -1.533689
H  0.800741 0.979281 1.341918
H  0.065941 3.857769 -2.226388
H  -1.325262 3.576675 -1.124925
H  -1.287517 2.830351 -2.760506
H  4.515041 -1.936341 -0.343481
H  2.986819 0.961862 2.510969
H  4.864618 -0.496954 1.691647
