program: Gaussian 09
title: 000290063
version: EM64L-G09RevD.01
frameworkgroup: C1[X(C15H21NO)]
method: RPBEPBE
basis: SDD
operation: Freq
keyword: #p
keyword: freq=noraman
keyword: PBEPBE/SDD
title: #p freq=noraman PBEPBE/SDD
converged: NO YES NO NO
title: Mulliken charges:
elementType: O N C C C C C C C C C C C C C C C H H H H H H H H H H H H H H H H H H H H H
charge: -0.432912 -0.347351 -0.139851 -0.116025 0.226115 -0.488589 -0.221973 -0.556439 -0.452999 -0.429400 0.356620 -0.399573 -0.400504 -0.663133 -0.246017 -0.257771 -0.240017 0.232062 0.206461 0.245986 0.205627 0.180951 0.213818 0.207971 0.210018 0.215764 0.215529 0.208384 0.254764 0.352774 0.255083 0.253401 0.218533 0.222728 0.225199 0.225758 0.227905 0.231103
chargesum: 0.00000
title: Mulliken charges with hydrogens summed into heavy atoms:
elementType: O N C C C C C C C C C C C C C C C
charge: -0.080138 -0.092588 0.092211 0.090437 0.226115 -0.036976 -0.041022 -0.134650 -0.027217 -0.005487 0.356620 -0.144490 -0.147102 0.003328 -0.020259 -0.029866 -0.008914
polarizability: 2.08253012e+02 -5.88223810e+00 1.34036342e+02 4.45243868e+00 9.56818111e+00 1.44992610e+02
1716.lowfreq: -11.4357 0.0006 0.0007 0.0009 11.5622 15.0967 58.4618 79.9368 84.5507
frequency: 58.4237 79.8921 84.5441 119.2926 139.2746 171.7452 192.9789 222.6456 238.5038 256.5215 296.7648 308.9251 337.8835 372.1194 379.5588 395.5385 409.0451 422.7832 451.8256 463.2870 528.2144 563.1816 616.3982 623.2666 656.0997 687.6076 715.6535 722.5024 758.4065 772.4784 805.8376 835.6324 854.4250 862.9349 879.7377 889.4518 916.5521 933.0293 944.0670 975.1581 985.8246 988.6991 995.5979 998.9623 1001.5292 1012.8722 1029.2857 1046.0527 1053.0574 1071.9015 1085.1223 1093.2721 1116.9264 1125.0847 1142.0687 1156.6847 1163.5159 1173.5348 1181.6737 1193.9597 1197.5282 1213.4224 1219.9281 1246.2718 1275.1059 1281.7475 1296.0581 1311.6368 1313.4744 1318.2577 1322.4183 1351.8748 1353.8193 1369.5328 1375.1893 1430.5704 1432.6738 1446.8973 1451.8903 1459.0534 1462.0997 1471.5564 1478.7277 1485.6975 1498.1351 1585.0034 1605.0359 2893.7692 2909.8343 2983.5579 2988.7208 2996.2626 3003.1371 3018.5510 3024.3901 3037.7887 3040.1492 3066.4303 3074.5688 3079.6903 3085.4529 3104.4077 3125.1832 3137.3156 3154.0093 3165.5128 3422.8010 3515.6290
redmass: 3.6500 3.2811 2.6821 3.6903 2.4993 1.7877 3.2946 2.7882 2.2721 3.3901 2.7532 3.1628 3.4118 1.3396 1.6690 3.5885 2.6990 3.1202 2.3154 3.1598 3.2171 3.1093 6.2154 4.5994 1.8069 4.5051 1.6844 4.3557 1.3900 1.9516 3.3882 2.4636 2.3560 1.2728 2.8458 2.6189 1.9640 1.7862 2.4545 1.9742 1.3999 5.4606 1.9672 1.4214 2.6810 2.4500 2.2975 1.8029 1.8470 1.6532 1.5788 1.7358 1.4152 2.1092 1.5429 1.5467 1.8077 1.0559 1.4826 1.3237 1.2324 1.5811 1.3744 1.4564 1.4588 1.3184 1.7084 1.2936 1.5467 1.5730 1.3525 1.6334 1.4821 1.4806 5.0986 1.7142 1.3135 1.0875 1.1694 1.1290 1.1206 1.1040 1.5771 1.2501 1.0465 5.7447 5.8858 1.0831 1.0506 1.0640 1.0645 1.0654 1.0662 1.0806 1.0815 1.0968 1.0901 1.0967 1.0992 1.1005 1.1013 1.0870 1.0859 1.0921 1.0941 1.0998 1.0739 1.0651
irintensity: 0.4141 0.2291 0.0934 1.0675 1.2142 1.1821 1.2006 0.1347 1.4738 0.4680 3.3635 4.5413 3.8268 65.7160 23.0614 5.5946 7.0711 1.1153 1.9468 32.2577 5.5295 32.5394 0.2229 23.3660 95.1813 6.1438 61.4687 0.4259 16.1803 24.1201 3.4799 5.6257 1.0889 1.3576 13.8953 6.0432 9.1199 8.1831 8.0167 0.7780 0.7058 0.6285 4.5900 4.1136 49.2807 2.6418 9.2104 0.4392 6.2711 12.2989 5.1369 2.0277 0.1831 36.2273 0.5601 0.7429 17.6542 0.0887 0.6023 17.6887 4.0316 3.3847 20.1960 19.2545 8.0983 1.8336 5.6025 4.2343 12.4473 8.8483 1.1052 2.4060 12.9120 5.7243 0.8081 6.7585 6.3165 6.0205 6.2861 21.6153 16.3422 14.9355 3.6501 19.0737 12.9239 3.8891 8.7773 74.6145 77.1018 17.2092 12.0903 53.7431 73.3877 111.2300 44.8233 51.9581 36.4684 3.8940 26.1148 22.8076 60.4388 8.3212 0.6847 21.3331 31.7978 18.8401 3.6884 18.9268
temp: 298.150 k
press: 1.00000 atm
elementType: 8 7 6 6 6 6 6 6 6 6 6 6 6 6 6 6 6 1 1 1 1 1 1 1 1 1 1 1 1 1 1 1 1 1 1 1 1 1
symmnumber: 1
zpe: 865130.8 jmol-1
zpe.correction: 0.329511 hartree
zpe.thermalcorrener: 0.344726 hartree
zpe.thermalcorrenthalpy: 0.345670 hartree
zpe.thermalcorrgfe: 0.288450 hartree
zpe.sumelectzpe: -712.853624 hartree
zpe.sumelectthermal: -712.838409 hartree
zpe.sumelectthermalent: -712.837465 hartree
zpe.sumelectthermalfe: -712.894685 hartree
dipole: 1.9512 1.8644 -0.6544
dipole: 2.7769
quadrupole: -97.1832 -108.6861 -97.0805
quadrupole: -1.6923 -1.0248 3.4545
quadrupole: 3.8001 -7.7028 3.9027 -1.6923 -1.0248 3.4545
hfenergy: -713.1831347 hartree
pointgroup: C01 [X(C15H21N1O1)]
dipole: 0.7789545 0.7446662 -0.1797985 debye
polarizability: 208.0032647|-7.3301375|132.50098|4.5210607|8.244893|146.7777204 unknown
InChI: InChI=1S/C15H21NO/c1-16-15(13-5-3-2-4-6-13)10-11-7-8-12(9-11)14(15)17/h2-6,11-12,14,16-17H,7-10H2,1H3
charge 0 multiplicity 1
38 atoms
O  -0.33396 -2.293269 -0.274537
N  -0.405373 1.380976 -1.034482
C  -2.412652 -1.144221 -0.580922
C  -2.438187 0.297031 1.302341
C  -0.210978 0.228439 -0.090334
C  -2.721841 -1.181576 0.93541
C  -0.882381 -1.02692 -0.78693
C  -0.90009 0.5144 1.278314
C  -3.200432 0.11439 -1.051868
C  -3.214623 1.071111 0.191294
C  1.322774 -0.017413 0.072474
C  2.04589 0.34221 1.238983
C  2.070295 -0.50986 -1.037429
C  0.1249 2.703474 -0.641833
C  3.452786 0.206604 1.302461
C  3.472281 -0.660046 -0.97538
C  4.173716 -0.299866 0.199345
H  -2.734815 -2.061479 -1.105836
H  -2.804653 0.562271 2.312368
H  -2.091537 -1.905009 1.479184
H  -3.785391 -1.437559 1.103995
H  -0.676584 -0.953835 -1.881698
H  -0.654346 1.540733 1.611423
H  -0.467977 -0.174405 2.02967
H  -4.228144 -0.183593 -1.333318
H  -2.733796 0.601422 -1.924035
H  -2.746088 2.040833 -0.043878
H  -4.251609 1.263225 0.526754
H  -0.074254 1.11732 -1.973551
H  0.657283 -2.244179 -0.299592
H  1.514357 0.730044 2.113097
H  1.553632 -0.775651 -1.969644
H  0.039179 3.384605 -1.507086
H  1.188779 2.694763 -0.310729
H  -0.480787 3.137924 0.173337
H  3.983741 0.496274 2.216687
H  4.016305 -1.054819 -1.841127
H  5.262379 -0.410748 0.250975
