program: Gaussian 09
title: 000290062
version: EM64L-G09RevD.01
frameworkgroup: C1[X(C14H18O2)]
method: RPBEPBE
basis: SDD
operation: Freq
keyword: #pfreq=noraman
keyword: PBEPBE/SDD
title: #p freq=noraman PBEPBE/SDD
converged: NO YES NO NO
title: Mulliken charges:
elementType: O O C C C C C C C C C C C C C C H H H H H H H H H H H H H H H H H H
charge: -0.464697 -0.453509 -0.225304 -0.128639 0.335605 -0.525397 -0.557563 -0.467213 -0.464207 -0.473573 0.588240 -0.440228 -0.414267 -0.238231 -0.238591 -0.240564 0.274274 0.230433 0.225333 0.257779 0.243377 0.187852 0.216257 0.226418 0.227285 0.200325 0.217994 0.349702 0.351887 0.223606 0.297574 0.224861 0.225505 0.227675
chargesum: 0.00000
title: Mulliken charges with hydrogens summed into heavy atoms:
elementType: O O C C C C C C C C C C C C C C
charge: -0.114995 -0.101622 0.048971 0.101794 0.335605 -0.042285 -0.126334 -0.024538 -0.036597 -0.255579 0.588240 -0.216622 -0.116693 -0.013370 -0.013085 -0.012889
polarizability: 1.77102127e+02 1.56650561e+01 1.23175051e+02 -8.20716841e+00 6.45373926e+00 1.38102565e+02
1716.lowfreq: -7.9654 0.0008 0.0009 0.0011 11.3616 15.7579 39.7717 62.5368 86.9489
frequency: 39.5402 62.4732 86.9379 119.7592 159.2783 201.9748 263.7925 274.3533 278.7776 294.6912 299.0644 341.7495 378.9884 406.6847 424.8870 454.2988 472.3831 545.9439 579.3083 616.5566 623.3148 634.7111 712.4614 751.5299 758.0667 772.2908 785.7959 794.8663 821.2672 846.4233 863.4926 882.7804 896.5833 906.3050 932.6355 940.9259 943.2472 957.1653 972.7234 985.9514 988.8486 993.3355 1010.0601 1021.7596 1029.3198 1040.7799 1052.9694 1080.1027 1090.1477 1116.4907 1144.7041 1152.7609 1170.2139 1172.1720 1177.0823 1192.1472 1210.6575 1229.6441 1239.9626 1246.2668 1267.1682 1288.5896 1290.1460 1299.9625 1308.6313 1313.4011 1327.4091 1356.0509 1371.4773 1391.1328 1444.2017 1453.6776 1467.4371 1473.8983 1485.1676 1492.6361 1592.0563 1615.2528 2978.6791 2994.3762 2997.1046 3014.6643 3016.6501 3047.0626 3055.6909 3064.9157 3074.8512 3094.9802 3100.9706 3110.8939 3124.9842 3138.5004 3152.4325 3163.4631 3435.5057 3539.3872
redmass: 4.0735 4.1499 3.3117 3.9495 4.2687 3.9588 3.3689 2.5718 1.6895 4.2905 1.9382 3.9151 3.6863 2.8630 2.6025 2.2961 2.7485 3.6236 2.1799 6.2428 1.3955 4.3546 1.7083 3.8355 3.6259 2.3670 2.9053 2.0761 2.2178 2.5265 1.2663 2.6553 2.5696 2.9777 2.8946 2.0803 1.6094 2.1087 1.7199 1.4348 2.6743 2.5909 1.4242 1.7710 2.1408 2.0453 1.6317 1.6251 1.5344 1.0803 1.4909 1.4131 1.5942 1.0654 1.8319 1.1271 1.3990 1.4911 1.5964 1.5035 1.3375 1.3986 1.5928 1.5557 1.3892 1.4888 1.3190 1.5909 2.3959 3.0689 2.0641 1.1028 1.0936 1.0819 2.3458 1.0970 6.0207 6.0874 1.0645 1.0602 1.0832 1.0613 1.0626 1.1036 1.0967 1.0938 1.1032 1.1043 1.0905 1.0876 1.0866 1.0923 1.0955 1.1009 1.0640 1.0660
irintensity: 0.1579 0.5001 0.1002 6.9208 5.9003 2.4229 5.9729 0.8300 72.3769 2.3391 18.3494 4.6143 6.4849 0.7268 3.4771 1.2465 1.4024 2.2400 25.4171 0.1215 180.2225 8.2842 63.1241 29.8799 16.6755 35.1107 2.2934 13.0134 16.4808 9.3026 1.6058 19.1789 24.4184 22.8725 3.8871 5.3975 1.7137 3.8941 1.3307 1.9039 15.3514 11.4436 2.7301 20.8817 8.4450 11.7689 5.5169 2.6803 16.5134 0.8593 19.9198 48.5400 5.1837 0.7589 13.9863 1.4768 4.2659 14.1098 10.9552 2.8977 1.1375 13.1487 8.0776 5.7468 11.1765 8.5739 10.7419 28.1034 13.6874 5.8368 8.8573 6.0146 15.1547 4.7930 9.2248 7.7163 1.4843 0.4229 40.5036 57.3055 13.9639 45.5738 37.1701 9.0482 32.5118 48.5724 74.9689 26.2977 14.2508 10.7626 2.2539 28.1212 11.9533 30.2276 30.1840 7.5899
temp: 298.150 k
press: 1.00000 atm
elementType: 8 8 6 6 6 6 6 6 6 6 6 6 6 6 6 6 1 1 1 1 1 1 1 1 1 1 1 1 1 1 1 1 1 1
symmnumber: 1
zpe: 758353.6 jmol-1
zpe.correction: 0.288842 hartree
zpe.thermalcorrener: 0.302602 hartree
zpe.thermalcorrenthalpy: 0.303547 hartree
zpe.thermalcorrgfe: 0.248641 hartree
zpe.sumelectzpe: -693.516619 hartree
zpe.sumelectthermal: -693.502858 hartree
zpe.sumelectthermalent: -693.501914 hartree
zpe.sumelectthermalfe: -693.556820 hartree
dipole: 1.0542 -1.1558 -2.0296
dipole: 2.5625
quadrupole: -91.3462 -96.5679 -91.3351
quadrupole: 4.7977 -4.7532 -2.0120
quadrupole: 1.7369 -3.4849 1.7480 4.7977 -4.7532 -2.0120
hfenergy: -693.8054606 hartree
pointgroup: C01 [X(C14H18O2)]
dipole: -0.5015767 0.4667126 -0.7396079 debye
polarizability: 175.5510893|18.6017081|126.6215726|7.1273641|-7.7832337|136.2070806 unknown
InChI: InChI=1S/C14H18O2/c15-13(11-4-2-1-3-5-11)14(16)9-10-6-7-12(14)8-10/h1-5,10,12-13,15-16H,6-9H2
charge 0 multiplicity 1
34 atoms
O  -0.71725 -1.877258 1.067886
O  0.337936 -2.086505 -1.406671
C  -1.363845 0.472993 0.986783
C  -3.415095 0.000074 0.098485
C  -1.075692 -0.790573 0.128778
C  -2.791053 0.149003 1.517762
C  -2.485495 -1.082952 -0.528814
C  -1.652116 1.697281 0.061439
C  -3.068704 1.3756 -0.545384
C  0.058654 -0.684048 -0.931487
C  1.38792 -0.100634 -0.481951
C  2.10267 0.730815 -1.381335
C  1.954824 -0.378347 0.789145
C  3.35672 1.275216 -1.028008
C  3.209698 0.164179 1.143542
C  3.915841 0.990964 0.238995
H  -0.582563 0.649903 1.739752
H  -4.486024 -0.259266 0.060099
H  -3.231107 0.978208 2.100533
H  -2.82082 -0.779947 2.110608
H  -2.811825 -2.097298 -0.237418
H  -2.47621 -1.020948 -1.635342
H  -0.875781 1.852117 -0.708048
H  -1.681426 2.616969 0.672581
H  -3.810126 2.142359 -0.255862
H  -3.060695 1.324621 -1.650016
H  -0.31077 -0.094177 -1.793336
H  -0.291025 -2.577739 0.497315
H  -0.374333 -2.347541 -2.047075
H  1.676948 0.946648 -2.369937
H  1.404862 -1.015191 1.489152
H  3.895547 1.914955 -1.73601
H  3.638061 -0.058921 2.127423
H  4.889674 1.409442 0.517717
