program: Gaussian 09
title: 000290060
version: EM64L-G09RevD.01
frameworkgroup: C1[X(C14H17NO2)]
method: RPBEPBE
basis: SDD
operation: Freq
keyword: #p
keyword: freq=noraman
keyword: PBEPBE/SDD
title: #p freq=noraman PBEPBE/SDD
converged: YES YES NO NO
title: Mulliken charges:
elementType: O O N C C C C C C C C C C C C C C H H H H H H H H H H H H H H H H H
charge: -0.450331 -0.428514 -0.098640 -0.211181 -0.091734 -0.501554 0.041492 -0.472410 -0.456187 -0.541959 0.062736 0.398711 -0.363542 -0.413968 -0.260312 -0.231581 -0.241830 0.259173 0.220905 0.213623 0.255781 0.245014 0.227186 0.222140 0.206966 0.250170 0.248230 0.345379 0.250892 0.273565 0.223603 0.223273 0.227142 0.367758
chargesum: 0.00000
title: Mulliken charges with hydrogens summed into heavy atoms:
elementType: O O N C C C C C C C C C C C C C C
charge: -0.104951 -0.060755 -0.098640 0.047992 0.129171 -0.032150 0.041492 -0.000210 -0.027082 -0.043559 0.062736 0.398711 -0.112649 -0.140402 -0.036709 -0.008307 -0.014688
polarizability: 1.89012492e+02 2.60858930e+00 1.45293261e+02 2.48053904e+00 -1.46174273e+01 1.32805836e+02
1716.lowfreq: -8.2526 -0.0010 -0.0006 -0.0002 10.0697 10.9969 41.0790 55.0377 83.3394
frequency: 40.4252 54.9227 83.2648 100.4126 129.3769 189.3471 230.4183 237.6801 271.6314 301.7898 307.2504 333.8275 352.0495 391.7196 398.1411 411.4356 425.6126 456.0596 477.4476 518.8061 549.2834 585.2069 616.1013 625.0123 680.6040 709.4469 725.7298 761.0295 762.1852 785.8495 826.2162 857.8261 860.3968 882.5076 886.9997 901.0040 920.5123 936.8001 939.0836 974.1885 981.9479 990.5400 993.1653 996.7373 1011.3272 1029.6272 1032.5832 1072.7152 1086.1740 1088.0256 1122.8417 1155.6079 1170.8129 1171.7138 1181.7429 1192.5513 1194.4330 1214.7507 1236.5004 1254.3416 1278.4716 1285.5067 1292.0442 1310.0490 1314.8852 1318.5059 1321.0655 1340.6055 1349.8141 1378.4257 1432.9054 1438.4208 1468.0059 1470.7244 1479.6839 1488.5187 1581.8634 1589.5174 1610.4958 2971.7721 2994.4867 3000.5764 3013.9370 3028.7772 3036.3629 3049.6664 3052.2548 3077.3770 3084.6725 3121.2943 3131.0094 3146.6062 3156.6235 3167.5234 3535.0046 3563.4995
redmass: 3.5399 3.8970 3.7446 3.2005 3.2567 5.3962 3.5414 5.5542 4.7831 3.8755 3.6851 3.6511 3.0242 2.1840 1.8079 2.3029 1.5524 1.7782 2.8141 3.3756 3.1461 4.0318 6.3664 5.7871 4.7878 1.7647 4.5269 1.7424 2.9716 1.8078 3.2801 1.2490 3.8065 2.7251 2.6986 2.9159 1.8079 3.4249 1.8366 1.9951 1.4379 5.5151 2.2086 1.3629 2.2897 2.0810 2.1190 1.4060 1.6775 1.5953 1.4328 1.3968 1.1338 1.1425 2.0383 1.1574 1.5283 1.4521 1.4499 1.5805 1.6457 1.3632 1.7444 1.5539 1.5680 1.4343 1.5846 1.6872 1.4306 7.9157 2.1498 1.1024 1.0859 1.0828 2.1615 1.1034 7.2027 6.5297 6.0690 1.0644 1.0606 1.0647 1.0647 1.0884 1.0928 1.1018 1.0869 1.1021 1.1005 1.0845 1.0885 1.0930 1.0961 1.0990 1.0658 1.0674
irintensity: 0.2254 0.1351 0.3431 0.0746 0.1241 0.2429 0.8996 1.2798 2.5107 4.3889 1.9881 5.1801 6.4293 1.7137 49.7012 36.3774 98.7207 87.3087 8.4507 6.7524 21.8503 3.1902 1.8234 39.3925 10.6565 51.0264 2.9750 38.5696 40.2155 10.7095 24.2366 0.7477 68.4508 20.9335 11.8487 21.9310 5.3667 37.7568 2.4485 21.8038 2.2536 0.1628 13.6296 1.7519 6.6215 6.7265 1.6865 2.8123 2.9251 3.5125 4.2247 3.4779 5.3951 4.1824 27.6295 1.1713 7.5189 4.2331 29.4929 7.7827 48.6516 4.8487 9.4214 13.5451 5.0665 1.4793 16.4212 6.3017 7.5793 0.7096 9.1455 21.1495 15.2188 4.1246 18.5592 10.3761 1.3379 1.1685 3.6406 8.8879 25.7115 35.1326 41.2931 67.9547 25.9779 15.7149 22.9404 43.5709 21.4062 0.4916 11.1401 22.5754 33.8518 9.8463 7.2627 42.4219
temp: 298.150 k
press: 1.00000 atm
elementType: 8 8 7 6 6 6 6 6 6 6 6 6 6 6 6 6 6 1 1 1 1 1 1 1 1 1 1 1 1 1 1 1 1 1
symmnumber: 1
zpe: 739033.1 jmol-1
zpe.correction: 0.281483 hartree
zpe.thermalcorrener: 0.296180 hartree
zpe.thermalcorrenthalpy: 0.297124 hartree
zpe.thermalcorrgfe: 0.240151 hartree
zpe.sumelectzpe: -747.571903 hartree
zpe.sumelectthermal: -747.557206 hartree
zpe.sumelectthermalent: -747.556262 hartree
zpe.sumelectthermalfe: -747.613235 hartree
dipole: 0.0127 0.3994 -0.9277
dipole: 1.0101
quadrupole: -95.0125 -94.1919 -99.3321
quadrupole: -1.4744 -1.0327 -0.6653
quadrupole: 1.1664 1.9869 -3.1533 -1.4744 -1.0327 -0.6653
hfenergy: -747.8533863 hartree
pointgroup: C01 [X(C14H17N1O2)]
dipole: 0.0000048 -0.1327798 0.374574 debye
polarizability: 189.0362591|-2.7817576|143.3423905|-1.7282009|-15.335173|134.7329397 unknown
InChI: InChI=1S/C14H17NO2/c16-14(11-4-2-1-3-5-11)12-7-6-10(8-12)9-13(14)15-17/h1-5,10,12,16-17H,6-9H2
charge 0 multiplicity 1
34 atoms
O  0.296197 0.001126 -2.161875
O  1.578863 -3.240629 0.306738
N  0.57719 -2.210323 -0.033109
C  0.8116 1.50279 -0.351659
C  2.976445 0.721605 0.286481
C  2.289998 1.573163 -0.809798
C  0.217809 0.091758 -0.668098
C  0.915139 1.778046 1.179647
C  2.339293 1.270319 1.599928
C  2.626441 -0.769279 0.06221
C  1.141471 -1.025192 -0.134707
C  -1.255362 0.019543 -0.227603
C  -1.675451 -0.527758 1.010901
C  -2.230668 0.61115 -1.072782
C  -3.035294 -0.488384 1.391744
C  -3.590674 0.647521 -0.69522
C  -4.000226 0.097059 0.541014
H  0.167709 2.23758 -0.864751
H  4.076432 0.829343 0.28911
H  2.645225 2.620869 -0.774131
H  2.438105 1.185554 -1.831284
H  0.104396 1.293681 1.749493
H  0.821789 2.864276 1.358404
H  2.947014 2.10225 2.000316
H  2.294475 0.493693 2.385491
H  2.980101 -1.396766 0.901693
H  3.1555 -1.148259 -0.836928
H  -0.111417 -0.86717 -2.419883
H  -0.94534 -1.005893 1.670188
H  -1.91154 1.036239 -2.030413
H  -3.341659 -0.921753 2.350707
H  -4.328929 1.104568 -1.364222
H  -5.055461 0.122174 0.835866
H  1.012731 -4.050699 0.389829
