program: Gaussian 09
title: 000290059
version: EM64L-G09RevD.01
frameworkgroup: C1[X(C15H19NO)]
method: RPBEPBE
basis: SDD
operation: Freq
keyword: #p
keyword: freq=noraman
keyword: PBEPBE/SDD
title: #p freq=noraman PBEPBE/SDD
converged: NO YES NO NO
title: Mulliken charges:
elementType: O N C C C C C C C C C C C C C C C H H H H H H H H H H H H H H H H H H H
charge: -0.205734 -0.407109 -0.226292 -0.121931 0.280169 -0.524369 -0.573049 -0.488247 -0.466286 0.041761 -0.655554 0.245996 -0.293170 -0.359731 -0.265984 -0.236401 -0.227123 0.278107 0.231821 0.255874 0.218874 0.203635 0.254422 0.230261 0.196258 0.196688 0.229556 0.260881 0.244886 0.217779 0.212463 0.287723 0.276160 0.227356 0.230311 0.230000
chargesum: 0.00000
title: Mulliken charges with hydrogens summed into heavy atoms:
elementType: O N C C C C C C C C C C C C C C C
charge: -0.205734 -0.146228 0.051815 0.109890 0.280169 -0.049621 -0.114993 -0.061729 -0.040042 0.041761 0.019574 0.245996 -0.005447 -0.083571 -0.038628 -0.006090 0.002877
polarizability: 2.12432659e+02 -3.32335246e+00 1.35962055e+02 1.05131994e+01 1.66655533e+01 1.39828910e+02
1716.lowfreq: -14.3920 -4.7116 -0.0008 -0.0005 0.0001 5.9912 27.4877 49.0540 98.1748
frequency: 27.0596 48.8747 98.1669 104.0810 111.5432 136.4918 172.9803 184.2838 212.0260 238.3854 280.4756 338.6903 368.8080 382.0832 399.7359 413.2288 440.9590 441.8063 512.5323 531.6955 576.8097 612.3426 615.7615 670.8182 693.4039 710.7999 752.1463 771.4688 794.1411 799.3985 831.2288 849.3020 863.6122 893.3121 913.1943 931.0288 941.1934 954.4249 957.8602 971.9330 986.4362 988.3909 996.8126 1006.5683 1015.2074 1028.1313 1042.5323 1052.8025 1064.4081 1082.5313 1096.1490 1114.2821 1125.3459 1137.1153 1149.6475 1171.6607 1175.4204 1184.6114 1189.3783 1220.5731 1230.0304 1247.4513 1259.7532 1265.4082 1282.3804 1293.4153 1303.0112 1313.1467 1316.2285 1384.0348 1432.6487 1434.1608 1438.3833 1464.6270 1465.6047 1471.3896 1475.7493 1476.9413 1494.5268 1496.0903 1553.8732 1587.6528 1607.6422 2909.9108 2990.2452 2993.5560 3006.9806 3012.3950 3025.0400 3041.0481 3053.6464 3059.6003 3067.8034 3078.0351 3085.4588 3094.9226 3124.1839 3136.3758 3150.4375 3160.3730 3167.5457 3452.5322
redmass: 4.5803 3.8695 2.8418 3.2587 3.3931 4.2101 1.8547 1.7073 2.7629 4.0076 2.9370 2.4513 3.5494 2.7297 2.8144 3.5632 3.5131 1.8614 3.4598 3.2884 4.3070 2.3981 4.0016 4.7564 2.6017 1.9613 4.3262 3.3163 2.0284 1.4971 3.3620 2.3262 1.2475 2.3446 2.1314 2.6448 2.0611 1.5229 2.0305 1.6902 1.7779 2.9230 1.7747 1.4075 2.5680 2.2344 1.8419 1.7111 1.6226 1.5890 1.3481 1.2109 1.5139 1.4560 1.8862 1.0617 2.1477 1.1943 1.8963 1.6479 1.9445 1.8048 1.5813 1.6346 1.7642 1.5412 1.5431 1.4914 1.3474 9.0168 1.9716 1.2061 1.2728 1.0518 1.0826 2.0427 1.0885 1.1257 1.0895 1.0613 8.3933 6.8734 6.2004 1.0509 1.0589 1.0609 1.0619 1.0617 1.0805 1.1037 1.0989 1.0955 1.1019 1.1003 1.1042 1.0901 1.0852 1.0891 1.0934 1.0954 1.1000 1.0745
irintensity: 1.3009 0.3638 1.2025 0.4038 1.1328 0.9767 2.3096 0.3295 0.8497 1.4243 4.1963 9.2850 8.6980 0.4091 0.1487 1.6007 1.4713 1.3389 3.4611 27.3499 4.6196 38.0467 13.7033 38.5393 21.5047 64.3316 11.7910 2.1034 15.5376 10.5373 52.8608 2.4006 0.1569 2.0185 11.8000 14.2056 16.8361 7.6672 0.5836 0.6158 4.0036 1.0601 0.2058 1.0551 6.8778 0.7601 8.2722 4.3773 2.9564 6.9994 4.2526 1.9803 12.9041 8.8512 13.7750 0.8372 16.3307 47.4874 5.5057 42.5011 48.5102 46.0975 13.7552 16.3032 2.6756 1.8468 8.4909 1.7626 1.7424 4.4818 10.0264 11.9980 5.1141 8.1569 0.4873 2.2264 12.3901 14.7928 9.3540 7.2178 115.3568 18.6049 8.6897 91.6892 36.7272 31.1129 74.1141 33.4551 38.4345 3.2859 32.1199 32.6192 80.4990 27.1592 44.3411 10.3226 0.5572 15.9289 11.1914 9.1245 38.3076 2.5770
temp: 298.150 k
press: 1.00000 atm
elementType: 8 7 6 6 6 6 6 6 6 6 6 6 6 6 6 6 6 1 1 1 1 1 1 1 1 1 1 1 1 1 1 1 1 1 1 1
symmnumber: 1
zpe: 803174.7 jmol-1
zpe.correction: 0.305913 hartree
zpe.thermalcorrener: 0.321014 hartree
zpe.thermalcorrenthalpy: 0.321958 hartree
zpe.thermalcorrgfe: 0.263458 hartree
zpe.sumelectzpe: -711.685313 hartree
zpe.sumelectthermal: -711.670213 hartree
zpe.sumelectthermalent: -711.669268 hartree
zpe.sumelectthermalfe: -711.727769 hartree
dipole: -0.3442 1.5535 2.2620
dipole: 2.7656
quadrupole: -90.2898 -99.3902 -104.7359
quadrupole: -2.4628 1.0554 -0.4496
quadrupole: 7.8489 -1.2516 -6.5973 -2.4628 1.0554 -0.4496
hfenergy: -711.9912266 hartree
pointgroup: C01 [X(C15H19N1O1)]
dipole: 0.1366493 0.781292 0.7448383 debye
polarizability: 212.0756756|-12.1269093|134.8757256|2.7180139|16.2753024|141.2722225 unknown
InChI: InChI=1S/C15H19NO/c1-16-15(10-11-7-8-13(15)9-11)14(17)12-5-3-2-4-6-12/h2-6,11,13,16H,7-10H2,1H3
charge 0 multiplicity 1
36 atoms
O  -0.147823 -1.723452 -1.29793
N  0.774524 -0.303771 1.707376
C  2.288367 -0.816149 -0.35565
C  2.530309 1.395725 -0.872385
C  0.971314 -0.173243 0.242951
C  2.504617 0.040831 -1.635067
C  1.157642 1.356573 -0.145307
C  3.506991 -0.377805 0.507955
C  3.662254 1.153799 0.171429
C  -0.285184 -0.773334 -0.471116
C  0.697439 -1.675927 2.248976
C  -1.658583 -0.202011 -0.221249
C  -1.950153 0.730333 0.812607
C  -2.708765 -0.623486 -1.085632
C  -3.261151 1.22829 0.971582
C  -4.01539 -0.122642 -0.926757
C  -4.296221 0.807522 0.104008
H  2.202659 -1.900239 -0.518815
H  2.673039 2.300301 -1.486898
H  1.679493 -0.043819 -2.361732
H  3.456262 -0.187869 -2.148417
H  1.130007 1.993417 0.759442
H  0.349206 1.70603 -0.811936
H  4.403512 -0.944891 0.198895
H  3.364539 -0.567567 1.587462
H  3.546027 1.802278 1.060305
H  4.654339 1.370089 -0.264929
H  1.43809 0.287132 2.22406
H  -0.177743 -2.198018 1.821719
H  0.550886 -1.625109 3.34241
H  1.594681 -2.303885 2.04473
H  -1.151498 1.008132 1.505784
H  -2.468819 -1.344641 -1.874041
H  -3.47812 1.938925 1.776981
H  -4.813981 -0.452109 -1.600752
H  -5.313267 1.196287 0.230943
