program: Gaussian 09
title: 000290058
version: EM64L-G09RevD.01
frameworkgroup: C1[X(C15H18O2)]
method: RPBEPBE
basis: SDD
operation: Freq
keyword: #pfreq=noraman
keyword: PBEPBE/SDD
title: #p freq=noraman PBEPBE/SDD
converged: YES YES NO NO
title: Mulliken charges:
elementType: O O C C C C C C C C C C C C C C C H H H H H H H H H H H H H H H H H H
charge: -0.298921 -0.264572 0.410036 -0.237027 -0.145930 -0.540465 -0.049763 -0.527956 -0.481480 -0.455096 0.361335 -0.378666 -0.388996 -0.533388 -0.231183 -0.228909 -0.240765 0.264422 0.231773 0.241441 0.224766 0.225612 0.238462 0.237438 0.226067 0.222892 0.208466 0.259316 0.272749 0.226072 0.240885 0.228248 0.226866 0.227170 0.229099
chargesum: 0.00000
title: Mulliken charges with hydrogens summed into heavy atoms:
elementType: O O C C C C C C C C C C C C C C C
charge: -0.298921 -0.264572 0.410036 0.027395 0.085843 -0.074258 -0.049763 -0.063882 -0.017975 -0.023737 0.361335 -0.119350 -0.116247 0.161816 -0.004317 -0.001739 -0.011666
polarizability: 1.86619373e+02 1.39099902e+01 1.39106207e+02 -6.65718001e+00 8.98477813e+00 1.41683254e+02
1716.lowfreq: -18.0728 -3.2478 -0.0008 -0.0004 -0.0003 9.3081 38.5695 50.6314 70.5498
frequency: 38.4855 50.3987 70.4307 81.9786 102.5023 141.8359 161.3163 205.4913 226.4625 255.8473 277.9959 339.1296 371.9398 384.3865 408.1241 420.2491 445.6817 456.6756 498.0398 555.4875 611.8868 617.1713 658.0624 681.7866 708.5348 755.9028 765.6695 778.4504 804.0901 839.9834 859.5673 865.6027 874.0435 888.0027 919.6907 922.5031 939.1294 942.2837 951.1013 955.9664 967.7357 989.1277 989.8300 1001.1303 1021.3865 1037.3444 1045.7990 1053.9040 1075.7022 1083.3014 1106.9599 1116.4068 1132.0518 1155.0916 1161.2054 1170.9928 1179.5504 1190.7507 1203.7826 1226.9912 1234.7665 1242.6846 1261.9279 1275.9161 1295.9891 1299.5162 1308.1794 1310.0622 1380.2487 1408.9511 1428.7901 1437.8823 1450.3295 1460.5456 1468.1321 1473.0741 1477.5809 1481.3650 1492.5043 1589.9280 1612.1443 2972.8714 2999.0116 3006.7848 3010.3700 3017.6009 3053.9089 3067.2149 3068.0554 3070.6271 3079.2305 3084.3733 3115.7662 3122.0081 3123.6661 3132.9598 3145.8156 3155.3530 3166.0812
redmass: 3.6849 3.7573 3.9753 3.1015 3.0640 3.1318 1.1264 2.7804 3.3592 3.4455 3.5285 4.7839 2.3315 4.0822 2.8966 3.2950 6.1015 2.3229 3.7821 6.0308 5.1235 4.7869 4.5859 5.0024 1.8828 2.8000 2.1844 4.0934 1.4882 2.6850 2.9158 1.4608 2.4029 3.1213 3.8635 3.2605 1.7358 1.6163 2.0844 2.0099 1.7221 2.7289 1.9080 1.3141 2.9469 1.7520 2.1701 1.8676 1.4783 1.4986 1.1115 1.2660 1.6141 1.4366 1.4925 1.0556 1.1492 1.8624 1.4817 1.7622 2.5109 1.5789 1.3527 1.8608 1.5574 1.6592 1.4789 1.3446 8.8363 3.1302 1.5067 1.8357 1.1169 1.0549 1.0878 1.0885 1.0614 2.3833 1.1081 6.3279 6.1127 1.0310 1.0593 1.0601 1.0597 1.0628 1.1042 1.0963 1.1034 1.0976 1.1054 1.1051 1.0908 1.1021 1.0848 1.0882 1.0929 1.0958 1.1008
irintensity: 0.4292 0.1194 0.4070 0.7462 5.0895 3.1479 0.3370 0.1561 0.6546 5.8148 0.3115 12.4607 2.6453 6.8220 0.1379 7.1467 2.5111 2.3011 3.4197 8.7609 8.0282 4.2319 14.2147 6.8248 42.3896 39.9932 45.0012 10.3106 9.9773 7.3074 19.0762 1.6254 6.0054 14.8088 28.8354 5.6806 22.8474 2.6956 0.7827 4.4552 3.3680 0.0406 0.0470 1.9599 44.4594 19.4013 57.5415 14.4660 7.1955 5.7854 4.5182 0.7698 8.0841 10.6405 1.4105 0.1121 6.4677 7.8297 2.6197 15.6771 35.9006 4.4669 0.5890 7.5148 4.3638 7.2138 2.4674 2.1992 0.2854 8.8480 3.2707 16.6214 9.2413 5.3160 6.5768 11.5297 10.7481 10.5924 7.4479 0.7199 3.0563 57.5756 36.0463 25.0767 37.8293 47.3360 6.5494 34.7458 37.3981 29.3251 25.6349 75.7226 13.6511 22.0479 0.2058 7.4569 19.1638 20.6281 20.3229
temp: 298.150 k
press: 1.00000 atm
elementType: 8 8 6 6 6 6 6 6 6 6 6 6 6 6 6 6 6 1 1 1 1 1 1 1 1 1 1 1 1 1 1 1 1 1 1
symmnumber: 1
zpe: 768739.1 jmol-1
zpe.correction: 0.292797 hartree
zpe.thermalcorrener: 0.307760 hartree
zpe.thermalcorrenthalpy: 0.308704 hartree
zpe.thermalcorrgfe: 0.250341 hartree
zpe.sumelectzpe: -731.532351 hartree
zpe.sumelectthermal: -731.517389 hartree
zpe.sumelectthermalent: -731.516444 hartree
zpe.sumelectthermalfe: -731.574807 hartree
dipole: -0.5723 -0.6484 1.0543
dipole: 1.3636
quadrupole: -91.5543 -96.2513 -101.2845
quadrupole: -0.4707 -0.5778 2.5946
quadrupole: 4.8091 0.1120 -4.9211 -0.4707 -0.5778 2.5946
hfenergy: -731.8251483 hartree
pointgroup: C01 [X(C15H18O2)]
dipole: 0.213815 0.3303909 0.3646222 debye
polarizability: 186.393877|15.0599479|135.6903574|5.2036383|-7.3139042|145.3245987 unknown
InChI: InChI=1S/C15H18O2/c1-16-15(12-5-3-2-4-6-12)14(17-15)10-11-7-8-13(14)9-11/h2-6,11,13H,7-10H2,1H3
charge 0 multiplicity 1
35 atoms
O  -0.337309 -1.093338 -1.487713
O  0.039535 -1.950481 0.81327
C  -1.111443 -0.212891 -0.500298
C  -2.484696 -0.702761 -0.026582
C  -2.801521 1.50708 -0.531011
C  -1.295591 1.274085 -0.866425
C  0.178975 -0.850913 -0.086573
C  -3.422824 0.137397 -0.943573
C  -2.735165 -0.044004 1.369408
C  -2.96781 1.474106 1.019938
C  1.486194 -0.104295 0.005934
C  2.10147 0.07197 1.272459
C  2.1020 0.435749 -1.149237
C  0.935401 -3.082362 0.4980
C  3.315945 0.784245 1.379825
C  3.317639 1.146731 -1.039814
C  3.927382 1.325141 0.22399
H  -2.587265 -1.795742 -0.041166
H  -3.226918 2.401806 -1.013519
H  -1.099507 1.412912 -1.945342
H  -0.616231 1.941802 -0.307824
H  -4.488426 0.043359 -0.667858
H  -3.302468 -0.092417 -2.017179
H  -1.886494 -0.208162 2.055024
H  -3.631734 -0.487946 1.837718
H  -3.982002 1.802006 1.311947
H  -2.24452 2.140865 1.523307
H  1.62448 -0.356141 2.161195
H  1.622637 0.27789 -2.120908
H  1.9979 -2.776422 0.54505
H  0.702927 -3.477386 -0.507609
H  0.72877 -3.844073 1.264767
H  3.784992 0.917394 2.361318
H  3.791052 1.556709 -1.939083
H  4.870724 1.876589 0.307562
