program: Gaussian 09
title: 000290054
version: EM64L-G09RevD.01
frameworkgroup: C1[X(C24H23NO2)]
method: RPBEPBE
basis: SDD
operation: Freq
keyword: #p
keyword: freq=noraman
keyword: PBEPBE/SDD
title: #p freq=noraman PBEPBE/SDD
converged: YES YES NO NO
title: Mulliken charges:
elementType: O O N C C C C C C C C C C C C C C C C C C C C C C C C H H H H H H H H H H H H H H H H H H H H H H H
charge: -0.216593 -0.280620 -0.197830 0.225585 -0.563550 -0.716891 -0.750393 0.068463 0.212452 0.445846 0.326336 0.241347 -0.393426 -0.423206 -0.336662 -0.389070 -0.322517 -0.375801 -0.226297 -0.258248 -0.259681 -0.230096 -0.240464 -0.230828 -0.260156 -0.229634 -0.227193 0.235092 0.265814 0.233837 0.208290 0.250599 0.239116 0.211847 0.283521 0.227754 0.328646 0.264483 0.256579 0.272484 0.260464 0.225593 0.234481 0.227645 0.228429 0.229052 0.228876 0.233704 0.230949 0.231874
chargesum: 0.00000
title: Mulliken charges with hydrogens summed into heavy atoms:
elementType: O O N C C C C C C C C C C C C C C C C C C C C C C C C
charge: -0.216593 -0.280620 -0.197830 0.225585 -0.062643 -0.024165 -0.015909 0.068463 0.212452 0.445846 0.326336 0.241347 -0.165671 -0.094561 -0.072180 -0.132491 -0.050033 -0.115337 -0.000705 -0.023767 -0.032036 -0.001667 -0.011412 -0.001952 -0.026452 0.001315 0.004681
polarizability: 3.42790166e+02 -1.02702425e+01 2.79614694e+02 -5.01733547e+00 2.30488076e+01 1.88679253e+02
1716.lowfreq: -4.4942 -2.6397 -0.0006 -0.0005 0.0004 5.8760 28.8673 31.2781 36.0164
frequency: 28.7440 31.1849 36.0067 42.1692 50.3782 56.4670 72.8692 104.2271 105.2897 128.1439 145.3201 183.2052 192.8620 205.7355 209.0486 218.4831 232.0587 248.2913 264.8771 288.8632 311.8728 336.9533 355.4663 372.1304 384.7620 400.9765 404.2915 405.1869 409.2065 447.5148 455.5430 467.9055 521.3523 568.7277 582.1515 603.6891 614.1830 614.4868 616.3224 651.0242 679.3258 695.6006 700.5018 705.0227 707.5692 710.9625 738.4127 752.3107 783.8949 786.4278 793.4616 805.3564 856.9187 860.0304 865.9618 909.7026 923.0145 929.1424 936.6418 942.4441 952.5645 980.0913 981.0260 985.8724 986.5596 989.4157 989.8622 990.7192 999.0216 1002.8823 1003.7970 1022.1839 1028.4764 1030.3528 1032.1948 1083.8943 1085.5889 1086.7497 1108.3280 1143.3365 1168.9951 1172.1112 1173.0644 1174.1130 1187.7853 1191.4887 1193.2302 1196.2107 1197.2143 1227.8923 1248.1994 1266.2150 1307.9711 1313.5566 1323.8638 1348.0817 1375.9613 1376.9426 1379.1761 1382.5818 1392.1086 1396.1852 1429.6419 1431.9811 1441.2747 1452.3679 1458.9989 1465.3975 1473.6141 1480.9766 1484.8729 1487.0752 1494.3042 1513.2348 1554.6516 1584.8369 1588.4775 1594.3000 1606.7571 1610.5300 1614.9845 2980.3817 2988.9447 2995.9971 3034.3347 3076.8327 3082.5322 3107.4918 3115.7092 3119.4471 3124.7025 3126.2837 3128.4757 3129.9913 3135.7476 3139.3144 3143.5194 3148.9629 3151.2730 3160.2785 3161.6262 3162.5250 3169.7732 3190.6336
redmass: 4.0668 5.0498 4.4978 4.4634 4.6852 4.8008 4.4812 4.2732 5.7597 5.8794 5.6841 3.8284 3.6734 4.6312 3.5675 1.3804 3.3159 2.1225 3.8941 1.4221 3.8759 3.7749 2.5821 5.8505 4.8324 3.3602 2.9313 2.8757 2.8772 3.1812 3.4334 3.4068 4.2753 4.7497 5.2410 3.7724 6.4281 6.4190 6.3703 6.5804 5.1644 4.3852 3.2061 1.7647 2.6024 1.8672 1.3345 4.3728 2.3207 3.0317 3.7794 3.0282 1.2445 1.2501 1.2602 1.5653 1.8162 1.4863 1.8708 1.5017 2.2325 1.9238 1.4811 2.3506 1.5152 2.2800 4.6019 4.1060 1.4004 1.3451 1.2917 1.6206 2.2379 2.0701 1.7882 1.5980 1.6337 1.6267 2.5995 2.9289 2.7413 1.0600 1.0542 1.0545 1.2739 2.2029 1.9943 1.2680 1.2317 4.2177 4.0150 1.5971 1.4952 1.3455 1.3283 1.3209 1.4867 3.5879 7.1496 3.8182 1.8827 1.8577 2.2404 2.2561 2.1361 1.0830 1.1117 1.0594 2.0352 1.2926 1.9251 1.9455 1.0902 6.7507 10.0641 6.2333 6.0922 5.9876 6.0670 5.9434 5.7167 1.0630 1.0387 1.0371 1.0966 1.0976 1.0972 1.0880 1.0902 1.0993 1.0850 1.0993 1.0851 1.0893 1.0890 1.0885 1.0950 1.0943 1.0928 1.0961 1.1010 1.0998 1.1012 1.0946
irintensity: 0.2008 0.3066 1.6328 0.5991 1.1973 1.5076 0.2227 0.1911 2.1065 5.5987 1.4712 0.4630 6.3575 0.5561 3.0944 0.1760 3.6934 0.9379 2.4165 0.1588 2.8969 5.5849 7.0327 7.2121 11.8200 3.7133 5.2965 0.9109 0.8747 1.1910 13.0396 11.3485 9.4607 1.4091 7.3041 9.0748 0.6942 0.2065 0.8348 7.5114 11.8165 9.7783 11.7308 29.4171 51.3704 93.5247 65.6452 6.2575 31.5457 12.4442 7.2227 18.3223 1.2905 3.2137 2.6623 3.3192 38.4751 2.0075 6.1111 7.0028 54.1767 40.8518 4.6178 3.6358 3.3164 0.2066 0.4372 2.1081 1.9607 0.9563 0.3116 22.5918 12.0967 1.6903 2.5428 9.3077 8.7525 7.5130 0.2814 14.6130 63.8838 0.5943 0.2576 0.1415 28.8000 8.1724 6.5067 5.6074 5.6833 72.9397 93.4411 61.5875 14.5217 0.4876 0.5277 10.0782 22.2341 12.8181 2.4004 105.5356 63.7225 44.4560 6.5488 12.2311 17.9312 5.6079 25.2975 8.5320 16.8935 16.3171 10.5730 12.6375 47.0842 223.2279 117.2359 4.5094 8.8555 0.6724 6.8614 3.2728 7.5793 19.3336 18.4855 28.2085 6.7827 0.7831 62.9290 9.6021 16.5120 12.8648 0.0376 7.5814 0.0952 5.5670 9.4842 11.3220 23.2643 23.9627 11.4320 7.7619 47.1697 31.1337 27.1631 5.7129
temp: 298.150 k
press: 1.00000 atm
elementType: 8 8 7 6 6 6 6 6 6 6 6 6 6 6 6 6 6 6 6 6 6 6 6 6 6 6 6 1 1 1 1 1 1 1 1 1 1 1 1 1 1 1 1 1 1 1 1 1 1 1
symmnumber: 1
zpe: 1060307.6 jmol-1
zpe.correction: 0.403850 hartree
zpe.thermalcorrener: 0.427855 hartree
zpe.thermalcorrenthalpy: 0.428799 hartree
zpe.thermalcorrgfe: 0.349300 hartree
zpe.sumelectzpe: -1131.644567 hartree
zpe.sumelectthermal: -1131.620562 hartree
zpe.sumelectthermalent: -1131.619618 hartree
zpe.sumelectthermalfe: -1131.699117 hartree
dipole: 1.7710 -0.6225 3.5996
dipole: 4.0597
quadrupole: -136.2985 -147.1058 -157.6736
quadrupole: 2.3471 -2.9541 3.6832
quadrupole: 10.7275 -0.0798 -10.6477 2.3471 -2.9541 3.6832
hfenergy: -1132.048417 hartree
pointgroup: C01 [X(C24H23N1O2)]
dipole: 0.5187675 -0.079455 -1.5085115 debye
polarizability: 316.8728013|27.6070489|302.6081857|-16.3614886|-30.5089701|191.6031257 unknown
InChI: InChI=1S/C24H23NO2/c1-24(2,22(26)20-14-8-4-9-15-20)25(18-19-12-6-3-7-13-19)23(27)21-16-10-5-11-17-21/h3-17H,18H2,1-2H3
charge 0 multiplicity 1
50 atoms
O  -1.659844 0.654173 1.110927
O  0.106116 -1.812995 0.89422
N  0.300108 -0.227331 -0.770585
C  -1.178045 -0.464169 -0.997181
C  1.092347 0.532595 -1.756193
C  -1.353591 -1.792528 -1.772312
C  -1.838748 0.683275 -1.810674
C  -1.873727 -0.382148 0.41555
C  0.858558 -1.011864 0.231666
C  1.130581 2.053681 -1.568357
C  -2.986079 -1.320338 0.803632
C  2.329848 -0.958492 0.545631
C  1.742225 2.844796 -2.573684
C  0.608331 2.685286 -0.413348
C  -2.849134 -2.731534 0.864581
C  -4.220487 -0.727163 1.185701
C  3.068017 0.247209 0.67122
C  2.966431 -2.19373 0.839765
C  1.838567 4.245948 -2.426911
C  0.703277 4.089249 -0.268789
C  -3.937394 -3.531212 1.274819
C  -5.311458 -1.530409 1.578988
C  1.31939 4.874019 -1.269885
C  -5.173891 -2.937535 1.621319
C  4.424841 0.211131 1.061831
C  4.325522 -2.227913 1.212506
C  5.060756 -1.023666 1.323749
H  0.708824 0.300555 -2.769176
H  2.126329 0.143155 -1.730143
H  -2.421454 -2.043928 -1.889841
H  -0.917177 -1.684324 -2.783304
H  -0.85149 -2.628123 -1.262215
H  -2.922565 0.479368 -1.881764
H  -1.446633 0.732481 -2.841524
H  -1.699259 1.658012 -1.321033
H  2.147224 2.36427 -3.47438
H  0.103177 2.083316 0.352636
H  -1.878547 -3.183018 0.64938
H  -4.306502 0.364924 1.178239
H  2.585677 1.213761 0.496223
H  2.376665 -3.114586 0.7877
H  2.314517 4.845495 -3.211264
H  0.290387 4.566481 0.627109
H  -3.816235 -4.618468 1.337977
H  -6.260971 -1.061806 1.860749
H  1.391318 5.961278 -1.153907
H  -6.016906 -3.563649 1.935023
H  4.98022 1.149314 1.168158
H  4.80771 -3.187786 1.427404
H  6.114477 -1.047555 1.623267
