program: Gaussian 09
title: 000290053
version: EM64L-G09RevD.01
frameworkgroup: C1[X(C13H17N5O)]
method: RPBEPBE
basis: SDD
operation: Freq
keyword: #p
keyword: freq=noraman
keyword: PBEPBE/SDD
title: #p freq=noraman PBEPBE/SDD
converged: YES YES NO NO
title: Mulliken charges:
elementType: O N N N N N C C C C C C C C C C C C C H H H H H H H H H H H H H H H H H
charge: -0.239218 -0.117092 -0.283947 -0.126968 0.019463 -0.050714 0.314632 -0.187689 0.153648 0.435444 -0.653127 -0.781761 -0.360475 -0.382965 -0.215485 -0.213985 -0.253946 -0.601473 -0.622728 0.269911 0.240311 0.245020 0.279307 0.234979 0.234049 0.283266 0.258928 0.226697 0.225017 0.227940 0.223059 0.274834 0.224967 0.247867 0.218400 0.253834
chargesum: 0.00000
title: Mulliken charges with hydrogens summed into heavy atoms:
elementType: O N N N N N C C C C C C C C C C C C C
charge: -0.239218 -0.117092 -0.283947 -0.126968 0.019463 -0.050714 0.314632 -0.187689 0.153648 0.435444 0.102115 -0.033425 -0.077210 -0.124037 0.011212 0.011032 -0.026007 0.121387 0.097372
polarizability: 3.19083328e+02 -1.46576654e+01 2.01152522e+02 -4.85015736e+00 1.13916681e+01 1.08090825e+02
1716.lowfreq: -8.2211 -4.8035 -0.0007 -0.0002 0.0002 5.7239 30.0832 37.5872 54.9035
frequency: 30.0476 37.5593 54.8979 60.3135 63.7280 91.2388 109.8200 132.8365 141.2755 159.8965 162.2424 182.3809 205.2004 218.7204 242.7819 257.9898 274.9188 287.1886 326.5993 359.6592 371.8477 408.9882 415.6006 429.6475 456.3296 490.8322 512.4298 576.7557 594.7502 612.5836 617.3172 668.5799 693.2397 710.0987 729.0304 762.5609 808.5496 840.7331 875.1183 906.8995 918.9155 969.3745 985.0448 988.8175 1009.5120 1024.5689 1030.9781 1038.7914 1042.6156 1048.8426 1075.3786 1087.0631 1088.8314 1124.0970 1127.5599 1142.3775 1171.4817 1185.6994 1196.3050 1264.4196 1284.3251 1314.4804 1325.2110 1336.8183 1372.2427 1382.9289 1388.7013 1409.4868 1416.4117 1435.1129 1439.4873 1442.8947 1444.1536 1455.9331 1468.6511 1471.4336 1478.3790 1483.2252 1484.2352 1489.5547 1494.7810 1587.6412 1599.2711 1606.8470 1630.3613 2961.1542 2968.6542 2973.5197 2976.1180 3033.7245 3049.5596 3050.9669 3081.5456 3105.1891 3110.6773 3119.9267 3123.3620 3126.2501 3137.1516 3151.2598 3164.3738 3191.9446
redmass: 3.0749 4.5804 2.3474 3.9040 2.4972 3.2932 3.9886 1.5710 1.7279 1.4801 1.6080 1.1679 2.7603 2.5614 3.2280 4.2420 3.2134 5.3722 3.7860 7.6716 4.7467 3.0541 3.7037 7.9573 4.6628 3.8542 4.0538 5.5854 6.2482 6.1545 5.4961 4.4149 2.6850 3.7063 7.3117 1.7840 5.1928 1.2525 3.8391 1.7007 2.8895 1.3642 3.2288 1.6090 3.3818 2.4599 2.0356 1.4997 1.6292 2.3057 2.4146 1.2469 1.7137 1.4979 1.3339 2.6838 1.0507 1.1485 3.4763 5.7978 4.3225 2.4319 1.8441 3.6811 4.6960 3.0760 1.9210 2.4558 1.1759 1.3236 1.3155 1.0542 2.0419 1.0931 1.1291 1.0470 1.0678 1.6155 1.3691 1.1196 1.1220 6.5144 7.3340 6.4442 11.2068 1.0360 1.0431 1.0390 1.0345 1.1017 1.0996 1.0963 1.0901 1.0971 1.1003 1.0970 1.1014 1.0851 1.0891 1.0940 1.0996 1.0958
irintensity: 1.3237 3.8761 2.1172 3.6262 2.0423 2.2074 2.3300 0.6749 4.1329 2.0722 1.4510 0.2343 3.0974 0.9670 0.6187 3.7569 1.4398 14.1626 10.0998 3.4582 3.1297 0.6280 0.4677 8.8530 15.4721 21.9928 49.3080 17.6188 7.6875 16.8864 14.1481 3.7175 16.9371 36.9102 8.5325 68.6283 1.5221 0.9598 17.3323 0.6052 8.7224 0.7195 0.9318 1.5190 94.4732 89.2606 8.8956 8.1160 1.2950 65.2288 86.2141 0.2454 4.0396 86.0873 0.4330 0.6579 0.2792 0.1309 6.9025 19.1939 6.3190 102.6277 33.8526 129.7362 325.9422 20.0728 24.2595 29.6549 23.4526 14.4230 33.4059 18.6553 23.1969 13.8946 36.3900 12.6543 20.8655 111.4496 37.1618 47.5077 5.0098 2.9144 30.6168 71.8555 240.0420 119.0867 69.7234 48.0371 72.2778 42.2130 28.0991 17.1357 14.7634 4.4991 16.0267 9.9588 11.2147 2.5372 12.7079 28.5744 25.5812 1.3138
temp: 298.150 k
press: 1.00000 atm
elementType: 8 7 7 7 7 7 6 6 6 6 6 6 6 6 6 6 6 6 6 1 1 1 1 1 1 1 1 1 1 1 1 1 1 1 1 1
symmnumber: 1
zpe: 753466.8 jmol-1
zpe.correction: 0.286980 hartree
zpe.thermalcorrener: 0.306411 hartree
zpe.thermalcorrenthalpy: 0.307355 hartree
zpe.thermalcorrgfe: 0.238147 hartree
zpe.sumelectzpe: -853.081409 hartree
zpe.sumelectthermal: -853.061978 hartree
zpe.sumelectthermalent: -853.061034 hartree
zpe.sumelectthermalfe: -853.130243 hartree
dipole: 1.3018 4.2524 -0.3720
dipole: 4.4627
quadrupole: -81.4320 -102.3601 -112.0732
quadrupole: -4.8969 0.8257 0.3739
quadrupole: 17.1898 -3.7384 -13.4514 -4.8969 0.8257 0.3739
hfenergy: -853.3683897 hartree
pointgroup: C01 [X(C13H17N5O1)]
dipole: -0.5552186 -1.6630624 0.0929639 debye
polarizability: 318.4207611|-17.799835|197.3249501|0.6732839|-23.0049016|112.5809635 unknown
InChI: InChI=1S/C13H17N5O/c1-10-12(14-15-16(2)3)13(19)18(17(10)4)11-8-6-5-7-9-11/h5-9H,1-4H3
charge 0 multiplicity 1
36 atoms
O  -0.316585 1.666929 -0.599318
N  0.629212 -1.721016 -0.010792
N  0.920237 -0.371577 -0.394078
N  -2.734804 -0.367244 0.149958
N  -3.177981 0.825618 -0.206165
N  -4.514257 0.980432 0.023875
C  -0.76758 -1.805432 0.134743
C  -1.355902 -0.554661 -0.046188
C  -0.297108 0.422548 -0.391766
C  2.243201 0.143555 -0.252347
C  1.374379 -2.780738 -0.731166
C  -1.451902 -3.105401 0.428347
C  2.629468 1.267834 -1.027578
C  3.160223 -0.438906 0.662696
C  3.930396 1.794113 -0.884952
C  4.464199 0.087669 0.778649
C  4.85772 1.205294 0.006706
C  -5.071673 2.278701 -0.358507
C  -5.345685 -0.07752 0.616055
H  2.456397 -2.604857 -0.635137
H  1.10758 -2.809595 -1.806495
H  1.132418 -3.749283 -0.266221
H  -2.504601 -2.886472 0.668006
H  -0.989775 -3.627211 1.286569
H  -1.436739 -3.795934 -0.437328
H  1.907827 1.723578 -1.708585
H  2.836318 -1.269697 1.298522
H  4.221284 2.666951 -1.479954
H  5.166724 -0.366284 1.486779
H  5.868581 1.615701 0.104073
H  -5.849677 2.170688 -1.139243
H  -4.245223 2.888354 -0.75407
H  -5.517733 2.796049 0.512728
H  -5.348497 -0.979741 -0.024604
H  -6.372945 0.304255 0.728528
H  -4.944899 -0.379202 1.601761
