program: Gaussian 09
title: 000290043
version: EM64L-G09RevD.01
frameworkgroup: C1[X(C12H16N4O4)]
method: RPBEPBE
basis: SDD
operation: Freq
keyword: #p
keyword: freq=noraman
keyword: PBEPBE/SDD
title: #p freq=noraman PBEPBE/SDD
converged: YES YES NO NO
title: Mulliken charges:
elementType: O O O O N N N N C C C C C C C C C C C C H H H H H H H H H H H H H H H H
charge: -0.452603 -0.470887 -0.496096 -0.225604 -0.193832 -0.039079 -0.060599 -0.068972 -0.057606 -0.116779 -0.512392 -0.114541 -0.179511 -0.417052 0.128916 -0.210804 -0.093633 0.168109 -0.367479 -0.503043 0.245772 0.248252 0.239020 0.250937 0.250345 0.228971 0.214137 0.265918 0.360972 0.380070 0.271493 0.366679 0.242068 0.240340 0.236905 0.241606
chargesum: 0.00000
title: Mulliken charges with hydrogens summed into heavy atoms:
elementType: O O O O N N N N C C C C C C C C C C C C
charge: -0.091631 -0.090816 -0.129417 -0.225604 -0.193832 -0.039079 -0.060599 -0.068972 0.188166 0.131473 -0.022435 0.135804 0.049460 0.063003 0.128916 0.060689 -0.093633 0.168109 -0.125411 0.215809
polarizability: 2.21347955e+02 7.70294169e+00 1.74388901e+02 4.55295747e+00 1.00400141e+01 1.10858332e+02
1716.lowfreq: -18.8919 -9.0028 -2.8990 -0.0004 0.0005 0.0007 32.4395 35.3598 42.1221
frequency: 31.7465 35.2321 41.9287 56.9100 99.1731 113.2864 129.3572 146.7434 166.2158 189.3214 198.0525 217.2879 268.0678 278.9270 284.1119 290.1821 328.8261 333.3820 351.5769 375.3380 399.4318 418.2530 471.4915 494.3794 505.0660 552.0622 570.2518 589.0970 627.3344 641.3188 644.4897 650.1249 665.6848 702.3865 751.5198 788.9543 811.7192 833.6592 841.9272 879.9818 899.2271 917.5370 937.9392 958.7912 983.7697 1003.1453 1015.2902 1027.4401 1044.7800 1082.2410 1094.8554 1105.8570 1111.5432 1116.0812 1143.8081 1154.0877 1164.5336 1197.4185 1205.4422 1217.0798 1231.9704 1244.1714 1253.7598 1264.0729 1275.2467 1285.5762 1292.3300 1300.6302 1307.9634 1319.0387 1345.0395 1358.0578 1365.3586 1379.4372 1397.4717 1405.7373 1408.1081 1440.9188 1450.5870 1450.9392 1452.9322 1461.4738 1469.5689 1482.5650 1525.3243 1568.6379 2968.4672 2973.6714 2993.8950 3006.7062 3022.6532 3030.3017 3036.2262 3051.5759 3086.8366 3110.7753 3149.6697 3164.6135 3232.0203 3286.8272 3556.9777 3597.3174
redmass: 5.9367 5.3916 4.5540 6.8318 4.3231 4.5657 1.2875 2.5516 2.8906 4.4374 5.1540 5.8297 4.6745 4.2934 2.5952 5.6276 1.4923 4.3965 3.0593 4.0350 1.6958 2.3230 3.5891 7.8367 4.5156 4.5787 3.9252 3.4973 1.2283 5.2063 5.9542 3.1637 7.6020 6.8017 3.3928 6.3233 2.8138 1.6043 6.9148 2.4186 7.6640 1.4365 5.9066 2.1820 3.3817 2.9030 4.9754 4.1301 1.9001 3.3821 2.7713 2.9831 1.2530 3.1538 1.4931 1.7502 1.6129 1.3116 1.8333 1.5786 1.4659 1.3006 1.5024 2.2138 1.3070 2.5777 1.4326 1.5626 3.4602 3.6515 1.3977 1.6703 1.3818 4.1997 1.4649 1.3922 1.5136 1.5331 1.0617 2.4510 1.5181 1.0538 1.0902 1.0896 6.3947 10.0148 1.0779 1.0625 1.0859 1.0290 1.0691 1.0909 1.0851 1.0973 1.1036 1.1046 1.1052 1.0920 1.0987 1.0673 1.0657 1.0667
irintensity: 0.5239 4.1132 1.0660 0.5279 7.4607 2.8955 0.2313 3.9854 6.7991 4.2760 11.6599 7.9919 3.0996 8.6523 19.5170 2.4590 62.9653 7.5867 23.3598 11.3511 90.6997 53.9547 19.9032 3.5899 12.1015 33.2085 0.3075 9.1385 129.6969 24.5077 2.4297 33.4487 2.1537 0.6761 14.5406 10.9432 10.2767 10.4900 10.4893 20.2930 7.2941 12.6238 48.4619 22.1665 61.2198 21.6524 25.8606 67.9679 73.0357 40.0594 24.0201 39.7291 0.1104 21.1525 19.5695 5.7172 20.2120 17.8492 53.6719 10.9312 27.9581 10.5966 17.4460 72.4675 14.2509 100.3421 63.2364 8.9991 25.7492 185.7147 1.4228 2.9033 23.3175 12.7958 55.5866 8.4879 0.9866 40.8847 11.3724 34.1929 83.3389 36.2775 12.4943 13.6859 101.8402 284.5992 30.4830 17.3632 39.4398 51.0843 23.5443 2.4663 14.8523 49.8668 26.7417 25.6065 19.9281 12.9530 0.0660 277.5346 16.3946 11.0480
temp: 298.150 k
press: 1.00000 atm
elementType: 8 8 8 8 7 7 7 7 6 6 6 6 6 6 6 6 6 6 6 6 1 1 1 1 1 1 1 1 1 1 1 1 1 1 1 1
symmnumber: 1
zpe: 742648.4 jmol-1
zpe.correction: 0.282860 hartree
zpe.thermalcorrener: 0.301310 hartree
zpe.thermalcorrenthalpy: 0.302255 hartree
zpe.thermalcorrgfe: 0.235440 hartree
zpe.sumelectzpe: -985.240866 hartree
zpe.sumelectthermal: -985.222415 hartree
zpe.sumelectthermalent: -985.221471 hartree
zpe.sumelectthermalfe: -985.288286 hartree
dipole: -0.8341 3.9147 -2.0279
dipole: 4.4870
quadrupole: -122.8502 -109.9534 -114.6798
quadrupole: 4.8515 9.1564 4.6829
quadrupole: -7.0224 5.8744 1.1480 4.8515 9.1564 4.6829
hfenergy: -985.5237257 hartree
pointgroup: C01 [X(C12H16N4O4)]
dipole: 0.4506414 1.3463009 1.049165 debye
polarizability: 220.5694919|-9.8826963|176.5147771|-4.5318266|3.1851316|109.5109197 unknown
InChI: InChI=1S/C12H16N4O4/c1-20-12-8-11(13-4-14-12)16(5-15-8)7-2-6(3-17)9(18)10(7)19/h4-7,9-10,17-19H,2-3H2,1H3
charge 0 multiplicity 1
36 atoms
O  1.923958 -1.858128 -2.101547
O  4.181934 0.191957 -1.588017
O  4.19735 2.220753 0.13584
O  -4.55145 0.154214 0.153429
N  -0.122259 -1.308034 0.241888
N  -2.327637 -1.976753 0.18916
N  -0.450791 1.160285 0.227047
N  -2.821345 1.770789 0.177498
C  1.347264 -1.422435 0.234594
C  3.284956 0.071902 0.825801
C  2.051961 -0.685381 1.427848
C  2.011129 -0.862398 -1.039352
C  3.456483 -0.574419 -0.584287
C  3.01004 1.586319 0.77354
C  -0.884889 -0.137577 0.224764
C  -1.042105 -2.368607 0.210482
C  -2.250143 -0.57353 0.197637
C  -3.219241 0.468254 0.17598
C  -1.480546 2.05175 0.201292
C  -5.509486 1.285414 0.122036
H  1.570071 -2.504559 0.262996
H  4.193221 -0.085002 1.434045
H  2.364061 -1.412487 2.196094
H  1.351922 0.019931 1.906917
H  1.531306 0.088088 -1.350113
H  3.97756 -1.548784 -0.474105
H  2.891018 1.977294 1.803473
H  2.088757 1.806776 0.200392
H  2.472313 -1.53467 -2.86166
H  4.377391 1.096987 -1.197016
H  -0.710061 -3.404789 0.194675
H  4.068698 3.19777 0.065057
H  -1.212501 3.112284 0.198062
H  -5.389588 1.916354 1.018254
H  -6.494602 0.79872 0.102893
H  -5.347348 1.901612 -0.777697
