program: Gaussian 09
title: 000290041
version: EM64L-G09RevD.01
frameworkgroup: C1[X(C10H11FN2O4)]
method: RPBEPBE
basis: SDD
operation: Freq
keyword: #p
keyword: freq=noraman
keyword: PBEPBE/SDD
title: #p freq=noraman PBEPBE/SDD
converged: YES YES NO NO
title: Mulliken charges:
elementType: F O O O O N N C C C C C C C C C C H H H H H H H H H H H
charge: -0.163367 -0.199050 -0.196287 -0.231202 -0.251364 -0.211189 -0.045949 -0.202453 -0.442890 -0.301750 0.203216 -0.171585 0.077778 0.144437 0.115505 -0.224848 -0.673628 0.315401 0.278092 0.242702 0.245567 0.237490 0.298353 0.238068 0.236956 0.214773 0.232611 0.234611
chargesum: 0.00000
title: Mulliken charges with hydrogens summed into heavy atoms:
elementType: F O O O O N N C C C C C C C C C C
charge: -0.163367 -0.199050 -0.196287 -0.231202 -0.251364 -0.211189 -0.045949 0.112948 0.077904 0.181308 0.203216 0.126768 0.077778 0.144437 0.115505 0.250176 0.008367
polarizability: 2.02004347e+02 -8.31237647e+00 1.28934263e+02 4.48041259e+00 6.07167602e-01 8.74283525e+01
1716.lowfreq: -5.0301 -3.3536 -0.0006 -0.0004 0.0011 6.8949 24.7093 35.6796 59.8562
frequency: 23.7668 35.6668 59.8544 81.0647 95.2146 116.6163 120.8023 162.5552 200.1091 215.6310 222.5029 246.5432 274.2638 279.1530 322.0006 369.2514 410.3327 457.9040 461.8685 483.0678 510.9076 570.6325 625.9745 631.0452 649.1819 697.0963 706.3719 732.7811 742.9582 797.0814 806.0350 839.2283 857.1919 862.9837 903.5791 911.8175 982.3669 1010.5048 1015.8412 1057.0157 1072.1084 1101.7546 1105.5544 1125.8230 1133.2803 1154.5867 1181.2156 1192.4869 1247.4195 1248.7639 1276.0877 1295.9482 1312.7558 1336.5714 1343.2511 1381.1285 1400.8768 1446.3992 1462.1942 1469.6535 1471.5640 1482.7660 1486.7341 1491.8996 1601.3360 1648.9667 1700.5254 2989.1498 2998.9137 3021.4511 3028.1780 3036.5639 3081.1790 3095.8816 3110.4785 3113.2946 3127.6823 3196.4928
redmass: 5.6897 4.1046 2.7437 4.4976 6.2038 4.6778 2.8266 6.1938 2.4539 3.7530 6.0157 1.5426 6.3262 8.9829 3.7083 8.3187 3.9982 4.7729 9.3095 8.5383 6.0025 7.7439 6.4983 3.4089 8.6418 9.5724 6.3674 9.5337 7.0780 1.1009 3.5709 4.3287 1.4602 1.8903 4.9387 3.5496 2.7343 3.0720 2.2887 5.1296 2.7195 3.0527 2.9805 2.9718 1.4543 1.3006 2.6756 1.8072 1.1427 1.6116 1.4359 1.4778 2.2290 1.3677 1.5670 1.7376 1.2718 3.1686 1.0397 1.0875 1.1587 1.0995 1.1196 8.5931 9.5773 8.4913 12.5931 1.0806 1.0360 1.0584 1.0642 1.0624 1.1062 1.0984 1.1018 1.1033 1.1072 1.0948
irintensity: 2.4941 6.5493 1.4273 3.1197 4.4283 7.0620 2.0874 3.6316 3.0059 0.4733 0.6459 1.2729 2.9007 13.1744 2.5518 2.4439 0.5259 4.8964 0.2300 4.2286 6.0523 13.1017 0.7440 5.9099 11.2540 3.4999 4.5300 24.2321 25.4449 3.9884 12.4356 8.4726 11.4972 30.0109 26.3388 12.0224 109.1322 52.0664 118.2566 96.6911 67.3028 116.2246 11.6697 15.0748 5.5283 4.4953 20.9829 100.5918 1.1647 30.1564 5.5024 20.2867 252.6985 61.0533 25.3317 113.0119 42.6133 359.9882 12.6689 13.5196 19.6813 3.4910 14.4763 42.7241 280.4152 297.9734 259.7872 29.9723 20.8477 10.5523 12.7801 38.9900 2.5365 23.9418 7.6862 39.9924 14.8583 6.0668
temp: 298.150 k
press: 1.00000 atm
elementType: 9 8 8 8 8 7 7 6 6 6 6 6 6 6 6 6 6 1 1 1 1 1 1 1 1 1 1 1
symmnumber: 1
zpe: 541427.9 jmol-1
zpe.correction: 0.206219 hartree
zpe.thermalcorrener: 0.222106 hartree
zpe.thermalcorrenthalpy: 0.223050 hartree
zpe.thermalcorrgfe: 0.161224 hartree
zpe.sumelectzpe: -896.623721 hartree
zpe.sumelectthermal: -896.607834 hartree
zpe.sumelectthermalent: -896.606890 hartree
zpe.sumelectthermalfe: -896.668716 hartree
dipole: 0.1084 -1.6282 3.5208
dipole: 3.8806
quadrupole: -80.2596 -114.5419 -97.2880
quadrupole: -6.6321 12.1607 -0.3059
quadrupole: 17.1036 -17.1787 0.0751 -6.6321 12.1607 -0.3059
hfenergy: -896.8299401 hartree
pointgroup: C01 [X(C10H11F1N2O4)]
dipole: -0.0004976 -0.0136794 -1.5266817 debye
polarizability: 201.641596|3.8232841|121.6556966|-10.8751536|-15.6386864|95.0696696 unknown
InChI: InChI=1S/C10H11FN2O4/c1-2-16-8-6(11)5-13(10(15)12-8)7-3-4-17-9(7)14/h5,7H,2-4H2,1H3
charge 0 multiplicity 1
28 atoms
F  -1.661189 -2.621281 0.616906
O  4.28394 -0.657127 0.151965
O  2.795662 -0.958536 1.911034
O  -3.361811 -0.468647 0.140496
O  0.339275 2.358039 -0.554214
N  0.711761 0.107131 -0.003191
N  -1.540625 0.9829 -0.197662
C  2.150131 0.390784 -0.112747
C  2.763102 0.200436 -1.522813
C  4.259264 0.02416 -1.190502
C  3.049388 -0.474699 0.79768
C  0.213592 -1.150992 0.285192
C  -0.176288 1.240995 -0.271496
C  -1.147731 -1.355142 0.32296
C  -2.017624 -0.233159 0.07704
C  -4.272241 0.703402 -0.095575
C  -5.69282 0.165953 0.021305
H  2.265214 1.453906 0.181576
H  2.568841 1.062673 -2.178498
H  2.354359 -0.710723 -1.994967
H  4.808375 -0.632406 -1.88053
H  4.787635 0.987156 -1.081192
H  0.914373 -1.957159 0.510434
H  -4.036388 1.474696 0.658417
H  -4.04434 1.117736 -1.093259
H  -6.411635 0.98957 -0.141142
H  -5.884093 -0.616547 -0.73233
H  -5.873828 -0.261315 1.022013
