program: Gaussian 09
title: 000290038
version: EM64L-G09RevD.01
frameworkgroup: C1[X(C9H7ClO2S)]
method: RPBEPBE
basis: SDD
operation: Freq
keyword: #p
keyword: freq=noraman
keyword: PBEPBE/SDD
title: #p freq=noraman PBEPBE/SDD
converged: YES YES NO NO
title: Mulliken charges:
elementType: Cl S O O C C C C C C C C C H H H H H H H
charge: -0.039887 0.645046 -0.244149 -0.605601 0.442941 0.343722 -0.485907 -0.708588 -0.337524 -0.332472 -0.210984 -0.209364 -0.105169 0.260323 0.282050 0.272411 0.235943 0.274634 0.261523 0.261052
chargesum: 0.00000
title: Mulliken charges with hydrogens summed into heavy atoms:
elementType: Cl S O O C C C C C C C C C
charge: -0.039887 0.645046 -0.244149 -0.605601 0.442941 0.343722 0.056466 -0.436177 -0.101581 -0.057838 0.050540 0.051688 -0.105169
polarizability: 2.38884238e+02 -7.85801769e+00 1.22863553e+02 3.51812471e+00 4.57269904e-01 6.83220946e+01
1716.lowfreq: -10.5354 -3.5799 -2.9490 -0.0033 -0.0030 -0.0027 27.2654 48.2353 93.4481
frequency: 27.2363 48.2060 93.4471 111.9855 155.1454 189.1089 223.9500 259.2447 276.5428 339.8228 405.7126 416.5119 445.0492 454.9749 482.3289 567.7954 619.9405 626.3320 657.6480 705.2721 716.0721 754.6460 787.1489 826.4970 828.7718 845.8837 863.1841 940.3083 960.4296 976.6528 996.0496 1014.8451 1075.1026 1108.7578 1152.7087 1167.4220 1190.7396 1221.1088 1282.0494 1298.6634 1368.5905 1401.4133 1412.9564 1474.4211 1569.8438 1592.5974 1604.6309 3037.6383 3152.0942 3164.7563 3164.9532 3177.1792 3184.3753 3245.0867
redmass: 4.3826 10.3256 8.1678 7.6491 4.0500 4.3999 8.5502 8.5474 6.9530 5.9152 2.9280 5.5482 12.0916 6.5546 3.7538 6.3348 4.3468 5.3211 6.2493 2.6683 5.1441 1.7429 4.7236 3.5665 1.5620 1.5435 1.8419 4.4040 1.3730 1.3653 4.9618 3.5388 2.8374 1.3624 1.2359 1.1898 1.1199 1.6495 2.3828 1.2917 5.2900 3.7901 1.1199 2.4490 7.6344 8.2710 6.4502 1.0537 1.0890 1.1108 1.0919 1.0964 1.0974 1.0959
irintensity: 1.7978 3.0620 2.4094 3.5336 8.8285 2.7933 0.0373 8.1606 8.4596 12.5388 0.2023 3.5785 5.5713 7.1356 7.9708 30.7976 3.2934 7.4001 48.0629 13.4080 4.4764 71.3765 51.9553 33.6714 5.6596 37.1712 24.0488 6.9878 0.1736 0.4990 102.3623 32.9175 48.8124 9.1369 4.5419 9.6464 2.3303 5.9059 33.5688 2.5255 3.8197 9.5113 11.9603 107.4652 13.1157 30.5778 98.2050 25.6984 4.1314 3.1570 1.1648 3.4144 0.7769 10.4183
temp: 298.150 k
press: 1.00000 atm
elementType: 17 16 8 8 6 6 6 6 6 6 6 6 6 1 1 1 1 1 1 1
symmnumber: 1
zpe: 356869.0 jmol-1
zpe.correction: 0.135924 hartree
zpe.thermalcorrener: 0.147987 hartree
zpe.thermalcorrenthalpy: 0.148932 hartree
zpe.thermalcorrgfe: 0.095799 hartree
zpe.sumelectzpe: -1354.677606 hartree
zpe.sumelectthermal: -1354.665543 hartree
zpe.sumelectthermalent: -1354.664598 hartree
zpe.sumelectthermalfe: -1354.717731 hartree
dipole: -1.3028 1.6727 -3.3710
dipole: 3.9823
quadrupole: -106.7589 -79.3330 -95.8645
quadrupole: 10.6297 -13.0751 3.5617
quadrupole: -12.7735 14.6525 -1.8790 10.6297 -13.0751 3.5617
hfenergy: -1354.8135301 hartree
pointgroup: C01 [X(C9H7Cl1O2S1)]
dipole: -0.511508 -0.7058837 1.3018497 debye
dipolederiv: -1.022949 -0.0017842 -0.0515452 0.0185811 -0.1146292 -0.0055922 -0.063127 -0.0073662 -0.0636528 1.1725581 0.2822216 -0.1179326 0.0159321 0.4756362 -0.152779 -0.2803798 -0.2188325 0.5148079 -0.8881587 0.1380043 0.0168203 0.0769147 -0.7446158 -0.0580909 0.0077581 -0.1616059 -0.2737634 -0.7619549 -0.0788141 -0.1089895 -0.1226747 -0.4571431 -0.0238463 0.4460503 0.2238195 -0.4760255 1.0062721 -0.0134082 0.0589972 0.125789 0.6899508 0.0972942 0.1076271 0.1808819 0.1683773 -0.2037827 0.0610045 -0.0022032 0.0213237 -0.059013 -0.003582 -0.0132475 0.002144 0.031609 0.5519546 -0.1663247 0.0719996 -0.0363273 0.0992153 0.0261293 0.0184202 -0.0255912 0.2462759 -0.8843717 -0.2805509 0.0159005 -0.1609446 -0.2407222 0.0866209 -0.2816044 -0.054401 -0.4778646 0.0860964 0.0491918 0.0176216 -0.1379925 0.054478 0.0106968 -0.022993 0.0148926 -0.1159401 0.1111384 -0.0704869 0.0100709 0.1147387 0.0187282 0.0145404 0.0188833 0.0211861 -0.1140706 -0.4258483 -0.104641 -0.0299402 -0.1789825 -0.0042699 0.0003577 -0.0390575 0.0005166 -0.1003661 -0.4349529 0.1192536 -0.0004394 0.214771 0.0050802 0.0254603 0.010552 0.0220072 -0.101551 1.4205463 -0.0109947 0.0847687 -0.0381129 0.1560255 0.0274198 0.0940368 0.0251069 -0.0530417 0.0093347 0.0160456 0.0100773 0.0139775 -0.0064278 0.0816662 -0.0723327 0.0929321 -0.0604423 0.0176039 0.0327376 0.0233752 0.0065948 0.0348412 -0.0155944 0.0594437 -0.0368053 0.0402357 0.0215808 0.0623569 0.0378031 0.075822 0.0621115 -0.0452105 0.039564 -0.0062078 0.2135019 0.0453407 -0.0949133 -0.0212004 -0.072357 -0.0079785 -0.0177591 -0.0073046 -0.0230023 0.1400043 0.0956435 0.0656196 -0.0013859 0.064251 0.0237874 -0.0108546 -0.0070568 -0.0137644 0.1558393 0.0456322 0.0586202 0.0006658 0.0620278 0.0057413 -0.0142382 0.0016004 -0.0130886 0.165023 0.0383165 -0.0631379 -0.0144637 -0.0633318 0.0092039 -0.0226383 -0.0168327 -0.022822 0.161044 unknown
polarizability: 238.5586978|10.3131918|123.1696051|-1.5924257|2.0418581|68.3415818 unknown
InChI: InChI=1S/C9H7ClO2S/c10-8-3-1-7(2-4-8)9-5-13(11)6-12-9/h1-5H,6H2
charge 0 multiplicity 1
20 atoms
Cl -5.000797 0.084362 -0.228405
S  3.773087 0.540788 0.297944
O  1.66387 -1.276571 -0.166119
O  4.204831 1.082265 -1.219245
C  1.092136 -0.029055 0.182132
C  -0.377799 0.004812 0.081857
C  3.077962 -1.33311 0.148126
C  1.959374 0.965359 0.536028
C  -1.08594 1.234099 0.175147
C  -1.106561 -1.198995 -0.116638
C  -2.490546 1.263386 0.083051
C  -2.512953 -1.181494 -0.21399
C  -3.1858 0.051135 -0.108742
H  3.230879 -1.773686 1.147177
H  3.625723 -1.826198 -0.66647
H  1.718736 1.996341 0.785112
H  -0.544645 2.176491 0.305326
H  -0.56512 -2.145187 -0.197949
H  -3.035473 2.208879 0.151657
H  -3.073464 -2.107522 -0.368399
