program: Gaussian 09
title: 000290037
version: EM64L-G09RevD.01
frameworkgroup: C1[X(C9H7NO4S)]
method: RPBEPBE
basis: SDD
operation: Freq
keyword: #p
keyword: freq=noraman
keyword: PBEPBE/SDD
title: #p freq=noraman PBEPBE/SDD
converged: YES YES NO NO
title: Mulliken charges:
elementType: S O O O O N C C C C C C C C C H H H H H H H
charge: 0.651707 -0.242464 -0.596878 -0.202618 -0.201887 0.027581 0.442753 0.352737 -0.484327 -0.696437 -0.323567 -0.322205 0.384974 -0.361939 -0.357719 0.285860 0.264526 0.275498 0.239787 0.281492 0.291629 0.291497
chargesum: 0.00000
title: Mulliken charges with hydrogens summed into heavy atoms:
elementType: S O O O O N C C C C C C C C C
charge: 0.651707 -0.242464 -0.596878 -0.202618 -0.201887 0.027581 0.442753 0.352737 0.066059 -0.420940 -0.083779 -0.040713 0.384974 -0.070310 -0.066222
polarizability: 2.70831214e+02 8.65719716e+00 1.38716270e+02 -3.84014177e+00 8.36439397e-01 7.11619371e+01
1716.lowfreq: -12.5754 -4.3559 -4.1030 0.0008 0.0010 0.0015 21.4243 46.0364 65.2434
frequency: 21.1232 46.0236 65.2431 90.5149 106.5981 150.7960 188.8157 214.2983 238.5604 257.2533 329.3636 403.5595 408.1703 441.9130 450.3468 471.8649 510.8805 566.5951 617.6540 625.3360 650.9443 663.6533 696.4019 730.8168 766.3481 778.9237 792.5203 830.9492 849.6629 862.7900 878.6545 940.5053 991.8189 1001.2306 1004.2481 1015.4043 1093.3569 1109.7752 1153.4741 1167.5548 1186.1286 1218.9985 1222.1390 1284.6520 1302.1174 1364.1462 1400.2383 1412.1874 1417.1968 1477.5170 1576.9443 1597.1989 1611.2358 3039.6828 3160.0037 3166.4040 3174.4629 3187.4599 3192.3193 3246.0689
redmass: 5.7989 9.3736 7.1415 8.1573 7.7753 4.1421 4.3606 7.6488 7.9062 7.6918 5.8780 5.4980 3.2297 10.0451 6.9059 4.5792 6.7116 6.4845 4.1387 6.6951 6.7575 3.8370 5.8816 2.4157 2.2290 6.6399 5.7606 6.6786 1.3031 1.8211 1.6122 4.5929 1.3561 3.9234 1.3618 3.1374 3.2566 1.3184 1.2343 1.1936 1.4569 3.5077 1.7880 2.4290 1.3062 7.2408 8.7664 1.1788 3.4288 2.4877 8.1366 8.4160 6.2000 1.0536 1.0898 1.1142 1.0890 1.0956 1.0973 1.0961
irintensity: 2.4873 4.1818 0.0621 3.4285 4.5133 12.4358 1.5685 0.8080 3.7243 11.1913 9.8277 4.2955 0.9716 8.9731 3.5195 1.1843 0.7601 23.0653 2.1231 3.3259 26.8750 17.4712 13.2316 42.4647 34.4897 64.4913 18.6675 15.3394 8.1319 13.6726 54.8481 16.8383 1.8984 38.3580 0.2177 43.6547 24.1868 16.7718 5.2263 2.4454 108.1498 306.6814 63.7549 18.7171 0.8978 78.1339 19.3073 5.1925 49.7653 12.5021 39.2744 4.3850 42.5775 22.1497 4.3383 2.3992 0.5728 1.2820 1.8197 8.7111
temp: 298.150 k
press: 1.00000 atm
elementType: 16 8 8 8 8 7 6 6 6 6 6 6 6 6 6 1 1 1 1 1 1 1
symmnumber: 1
zpe: 385323.4 jmol-1
zpe.correction: 0.146762 hartree
zpe.thermalcorrener: 0.160200 hartree
zpe.thermalcorrenthalpy: 0.161145 hartree
zpe.thermalcorrgfe: 0.104515 hartree
zpe.sumelectzpe: -1099.588377 hartree
zpe.sumelectthermal: -1099.574939 hartree
zpe.sumelectthermalent: -1099.573994 hartree
zpe.sumelectthermalfe: -1099.630624 hartree
dipole: -2.8474 1.6156 -3.6202
dipole: 4.8809
quadrupole: -132.2174 -85.3607 -97.9296
quadrupole: -9.8805 13.3801 2.9786
quadrupole: -27.0481 19.8085 7.2396 -9.8805 13.3801 2.9786
hfenergy: -1099.735139 hartree
pointgroup: C01 [X(C9H7N1O4S1)]
dipole: 1.135338 0.5846947 1.4341138 debye
dipolederiv: 1.1643623 -0.2766559 -0.1419599 0.0440654 0.4509795 0.1404203 -0.1576372 0.2127697 0.5431356 -0.8451411 -0.1395075 0.0133591 -0.1086784 -0.7496058 0.013219 0.0171105 0.1178243 -0.2557534 -0.7820518 0.0841916 -0.1013024 0.0626714 -0.4330402 0.030906 0.3732113 -0.2200285 -0.4741954 -0.8354576 -0.184316 -0.0088199 -0.3149997 -0.6489618 0.0217457 -0.0100322 0.021041 -0.2276086 -0.8452736 0.2060054 -0.0373572 0.3100627 -0.6613873 0.0403672 -0.0571405 0.0418608 -0.2296797 2.1847285 -0.0329762 0.0771623 0.0146531 1.0799075 -0.0645403 0.1093133 -0.0650009 0.200299 0.4137788 0.0471426 0.0359201 0.1287504 0.6986955 -0.0386433 -0.0469082 -0.1273231 0.1425121 0.385079 -0.0896949 0.0090688 -0.0571576 0.0818552 -0.0111689 0.0125873 -0.0162489 0.0620571 0.5590443 0.1552769 0.0802272 0.0376753 0.1001312 -0.0376781 0.0239497 0.0084999 0.2390769 -0.6509855 0.2660967 0.046742 -0.0264028 -0.2251351 -0.0701202 -0.2145498 0.0731518 -0.4584111 -0.3311141 -0.1445879 0.0077247 -0.1571878 0.0332782 -0.0136608 -0.0110696 -0.0110233 -0.113768 -0.3228188 0.1948203 -0.0105407 0.1865935 -0.0171741 0.0049379 -0.0290816 -0.0042304 -0.1204325 -0.9492319 0.0278549 -0.0337914 -0.01194 0.0709433 -0.0041075 -0.0521832 0.0023422 0.0556411 0.2200623 0.1282889 0.0004187 -0.1629599 -0.0341666 -0.0084752 0.0323254 0.0049117 -0.0945161 0.22823 -0.1657148 0.0249103 0.1472627 -0.0290644 -0.0000163 0.0187822 -0.0157435 -0.0988468 0.0223595 -0.0304298 0.0190496 -0.0080057 0.0362579 0.0127909 0.0552279 0.0325389 0.0465225 0.0225489 -0.0169294 0.0084444 -0.0126717 0.011158 -0.0728028 -0.0724351 -0.0799538 -0.0654326 0.0223476 -0.0645659 0.0358014 -0.0817571 0.068731 0.0294593 0.0312473 -0.009035 0.2142 0.049426 0.0907989 -0.0148936 0.0739778 -0.0028632 0.0095415 -0.0015652 0.0138152 0.1386466 0.0994255 -0.0580049 -0.0038473 -0.06689 0.0336183 0.0044672 -0.007905 0.0071133 0.1540126 0.0978282 -0.0521525 0.0007047 -0.0170276 0.0665522 0.0047015 -0.0052598 0.0031749 0.1721764 0.0928535 0.0550596 -0.007021 0.0199657 0.0692907 0.008657 -0.0079876 0.0095439 0.1703644 unknown
polarizability: 270.351863|-11.6628885|139.1979198|-4.1388165|0.4287799|71.1596382 unknown
InChI: InChI=1S/C9H7NO4S/c11-10(12)8-3-1-7(2-4-8)9-5-15(13)6-14-9/h1-5H,6H2
charge 0 multiplicity 1
22 atoms
S  4.451801 -0.577825 0.221118
O  2.348015 1.284152 -0.050457
O  4.833214 -0.995375 -1.34721
O  -4.58183 -1.173028 -0.077904
O  -4.589286 1.103502 -0.242405
N  -3.982497 -0.030275 -0.127432
C  1.774518 0.01601 0.197379
C  0.302401 -0.003932 0.11353
C  3.769436 1.30583 0.240922
C  2.636902 -1.011759 0.453387
C  -0.411633 -1.234297 0.153607
C  -0.415877 1.217251 -0.013933
C  -2.500224 -0.019791 -0.045458
C  -1.813599 -1.249019 0.07638
C  -1.819844 1.215376 -0.095262
H  4.304908 1.862081 -0.540417
H  3.942079 1.662325 1.269629
H  2.392952 -2.059645 0.613001
H  0.127772 -2.182842 0.2329
H  0.137601 2.158724 -0.051896
H  -2.382526 -2.181711 0.102998
H  -2.391785 2.141247 -0.195376
