program: Gaussian 09
title: 000290036
version: EM64L-G09RevD.01
frameworkgroup: C1[X(C9H8O2S)]
method: RPBEPBE
basis: SDD
operation: Freq
keyword: #pfreq=noraman
keyword: PBEPBE/SDD
title: #p freq=noraman PBEPBE/SDD
converged: NO YES NO NO
title: Mulliken charges:
elementType: S O O C C C C C C C C C H H H H H H H H
charge: 0.641397 -0.242699 -0.608911 0.444346 0.326134 -0.486621 -0.711478 -0.347745 -0.344220 -0.228908 -0.223364 -0.228863 0.280452 0.258598 0.272185 0.229839 0.268213 0.233499 0.233209 0.234936
chargesum: 0.00000
title: Mulliken charges with hydrogens summed into heavy atoms:
elementType: S O O C C C C C C C C C
charge: 0.641397 -0.242699 -0.608911 0.444346 0.326134 0.052429 -0.439293 -0.117905 -0.076007 0.004591 0.009845 0.006074
polarizability: 1.98083877e+02 6.96817358e+00 1.20959486e+02 -2.49209247e+00 2.87521478e-01 6.53806837e+01
1716.lowfreq: -10.6112 -3.0615 -0.0007 0.0006 0.0014 5.1012 28.1120 65.0997 124.6337
frequency: 28.0825 65.0571 124.6273 131.4423 189.2073 200.8560 273.2221 336.9017 399.2328 405.4389 446.5773 459.4447 555.0771 613.5076 623.4800 642.0381 690.8242 695.3645 743.4091 784.7387 786.0078 827.5564 853.9459 862.8565 934.9401 943.1691 984.1162 989.5466 1003.7802 1007.4487 1030.6192 1082.4740 1151.0400 1166.4575 1176.8788 1193.3137 1220.5939 1281.0340 1322.3216 1385.1421 1412.7942 1437.2095 1480.1714 1576.0270 1597.0650 1614.8681 3036.5361 3131.9512 3140.8574 3153.1692 3163.4996 3165.6589 3177.0798 3245.4603
redmass: 4.2200 7.5105 3.9491 5.8546 3.2097 5.9918 6.4806 6.1755 2.9204 5.3721 8.8643 4.0842 6.7935 6.4724 3.7233 4.8938 2.0897 4.0438 1.3549 2.1760 4.2089 6.5579 1.2541 1.8330 1.5615 3.5844 1.3982 6.0117 1.3348 4.9996 1.9969 1.5669 1.2542 1.1853 1.0572 1.1145 1.6433 2.3874 1.3564 8.0122 1.1084 2.2992 2.3153 6.6436 7.4957 6.0859 1.0537 1.0852 1.0886 1.0939 1.1138 1.0975 1.0988 1.0959
irintensity: 1.5673 5.1948 6.8341 1.8160 2.6291 7.9068 0.4885 15.4845 0.4164 4.4335 8.3491 0.2878 15.6175 0.7095 3.4570 6.2471 9.7379 58.9100 135.6975 7.2261 55.3900 13.5610 0.5233 20.4071 5.8162 13.4446 0.2466 2.0541 0.3411 79.7185 4.6252 10.0282 2.3193 6.2362 0.6319 3.8850 5.4803 31.4316 3.2256 1.0458 7.2557 13.0736 29.9665 59.6039 41.1438 6.9498 26.6716 0.7936 3.9945 24.7219 3.5348 21.2332 9.4446 9.2210
temp: 298.150 k
press: 1.00000 atm
elementType: 16 8 8 6 6 6 6 6 6 6 6 6 1 1 1 1 1 1 1 1
symmnumber: 1
zpe: 382470.8 jmol-1
zpe.correction: 0.145675 hartree
zpe.thermalcorrener: 0.156429 hartree
zpe.thermalcorrenthalpy: 0.157373 hartree
zpe.thermalcorrgfe: 0.107836 hartree
zpe.sumelectzpe: -895.288156 hartree
zpe.sumelectthermal: -895.277402 hartree
zpe.sumelectthermalent: -895.276458 hartree
zpe.sumelectthermalfe: -895.325995 hartree
dipole: 3.6217 1.5433 -3.1815
dipole: 5.0617
quadrupole: -77.5185 -68.5986 -84.0971
quadrupole: -9.7392 11.0943 2.9647
quadrupole: -0.7804 8.1394 -7.3590 -9.7392 11.0943 2.9647
hfenergy: -895.4338311 hartree
pointgroup: C01 [X(C9H8O2S1)]
dipole: -1.410589 0.6920927 1.223537 debye
dipolederiv: 1.1361744 -0.280668 -0.1086329 -0.023403 0.4708803 0.1522408 -0.2671997 0.2118646 0.5050773 -0.8536044 -0.1434363 0.0083221 -0.0681402 -0.746918 0.0603403 -0.0072005 0.1602266 -0.2746128 -0.7551319 0.082794 -0.1117967 0.120347 -0.4594865 0.0239301 0.4296089 -0.2200273 -0.4763944 0.9381069 0.0139406 0.0680617 -0.1288529 0.6915445 -0.1024885 0.1183999 -0.1812172 0.1722157 -0.1374292 -0.0582028 -0.0008228 -0.0101412 -0.019476 -0.0007862 -0.0117703 -0.0083675 0.0378184 0.5339547 0.1682479 0.0766042 0.0356992 0.1015679 -0.0245191 0.0240699 0.0301179 0.2506525 -0.8374476 0.2775559 0.0109615 0.1576469 -0.2406952 -0.085009 -0.2736166 0.0568913 -0.4840308 -0.0300983 -0.0755737 0.0143904 0.0619105 0.0230578 -0.0087883 -0.0205548 -0.0122143 -0.1283177 -0.0123322 0.0995878 0.0036147 -0.0452407 -0.0056245 -0.0060119 0.0051912 -0.0137318 -0.1256321 -0.084656 0.1176869 -0.0072048 0.1664636 0.0793822 -0.0085854 -0.0061846 -0.0090769 -0.1435869 -0.0792526 -0.1343766 0.0231861 -0.1865992 0.0809084 -0.0389596 0.0331994 -0.0371838 -0.1451 0.0650689 0.0122746 0.0214481 0.009748 -0.0214497 -0.015839 0.0170083 -0.0105503 -0.14328 0.0162386 -0.0353029 0.0241933 -0.0081989 0.0326896 0.0164916 0.0598298 0.0380926 0.040192 0.0118703 -0.0148362 0.0113817 -0.0116814 -0.0086316 -0.0831062 -0.0695126 -0.0963486 -0.0641147 0.0223123 -0.0621685 0.0332244 -0.0713018 0.0596467 0.0451743 0.0322708 0.0061047 0.2145752 0.0552481 0.1033347 -0.0207902 0.0790901 -0.0203853 0.0178786 -0.0058014 0.0240218 0.139997 0.1042199 -0.0729965 -0.0021736 -0.0714252 0.0063362 0.008045 -0.0085313 0.0116844 0.1555469 0.0221317 -0.0750565 -0.0017745 -0.103877 -0.0624312 0.0138288 0.0002082 0.0136617 0.1581201 0.0101827 0.0822576 -0.0194325 0.1056173 -0.0558823 0.0302831 -0.0243451 0.0291384 0.1531602 -0.1255562 -0.005062 -0.0227603 -0.0076611 0.0949669 0.0058805 -0.0250694 0.0069136 0.157714 unknown
polarizability: 197.4925179|-9.8362954|121.526926|-1.2739544|-1.7534027|65.4046023 unknown
InChI: InChI=1S/C9H8O2S/c10-12-6-9(11-7-12)8-4-2-1-3-5-8/h1-6H,7H2
charge 0 multiplicity 1
20 atoms
S  3.359195 -0.524176 0.351786
O  1.248192 1.278511 -0.161299
O  3.836379 -1.066185 -1.152406
C  0.676697 0.027504 0.177186
C  -0.7920 -0.018595 0.050476
C  2.654331 1.344763 0.181567
C  1.544635 -0.960254 0.548685
C  -1.486138 -1.258041 0.113516
C  -1.528956 1.181368 -0.141734
C  -2.889307 -1.292476 -0.00429
C  -2.933706 1.140531 -0.262846
C  -3.619391 -0.093847 -0.191824
H  3.216364 1.838946 -0.622648
H  2.78455 1.788272 1.182622
H  1.304765 -1.992036 0.794716
H  -0.9309 -2.193782 0.237593
H  -0.992174 2.132536 -0.198069
H  -3.414718 -2.252339 0.042081
H  -3.492597 2.070454 -0.412752
H  -4.710318 -0.124454 -0.28606
