program: Gaussian 09
title: 000290034
version: EM64L-G09RevD.01
frameworkgroup: C1[X(C16H12Br2O2S)]
method: RPBEPBE
basis: SDD
operation: Freq
keyword: #p
keyword: freq=noraman
keyword: PBEPBE/SDD
title: #p freq=noraman PBEPBE/SDD
converged: YES YES NO NO
title: Mulliken charges:
elementType: Br Br S O O C C C C C C C C C C C C C C C C H H H H H H H H H H H H
charge: 0.028619 0.042243 0.197186 -0.208797 -0.252785 -0.814786 -0.839743 0.320160 0.339952 0.187754 0.192921 -0.368636 -0.328829 -0.334228 -0.340165 -0.211643 -0.190485 -0.190932 -0.183772 -0.209401 -0.209033 0.302664 0.304947 0.330072 0.280221 0.303931 0.248357 0.284958 0.284002 0.261060 0.257867 0.257033 0.259287
chargesum: 0.00000
title: Mulliken charges with hydrogens summed into heavy atoms:
elementType: Br Br S O O C C C C C C C C C C C C C C C C
charge: 0.028619 0.042243 0.197186 -0.208797 -0.252785 -0.207176 -0.229450 0.320160 0.339952 0.187754 0.192921 -0.064705 -0.080472 -0.049270 -0.056163 0.049417 0.067383 0.066101 0.075515 -0.209401 -0.209033
polarizability: 3.91279075e+02 7.04247832e+00 2.20768458e+02 4.26476746e+00 -1.55893218e+01 1.36343136e+02
1716.lowfreq: -2.9033 -0.0017 -0.0008 0.0013 1.9963 3.6666 12.7489 23.2934 35.0996
frequency: 12.7374 23.2144 35.0625 36.3636 46.6072 70.6721 78.3309 86.8766 105.3416 152.2862 164.4228 179.0270 216.7017 236.2732 250.4912 254.7298 262.7426 285.4459 300.9867 402.2040 409.5208 412.5258 420.7507 461.9187 474.9094 486.1881 497.3623 541.2685 557.6252 617.0014 619.2264 622.7999 627.5238 693.0502 696.4511 735.9826 737.3455 753.4719 765.9079 830.4611 851.8426 856.0967 861.4638 872.4299 924.0308 962.6810 989.2161 992.3957 995.1994 995.6524 1002.3456 1017.4121 1027.1978 1059.9300 1060.9697 1112.1868 1115.6989 1128.3313 1153.6782 1189.8064 1197.6047 1213.9512 1230.5105 1279.0604 1288.4090 1296.2224 1305.2714 1366.2831 1366.5099 1394.3290 1395.7131 1436.7622 1444.6871 1472.9043 1475.9206 1533.9297 1551.1088 1577.7691 1581.6941 1591.4482 1593.2315 3043.1555 3054.6318 3122.8697 3128.7677 3131.4717 3153.7971 3154.6902 3156.4914 3170.3474 3175.0416 3175.4912 3179.0816
redmass: 14.1337 5.9549 10.2587 5.8073 8.1828 6.6955 9.0443 6.9324 11.0425 9.3067 9.1951 7.1436 9.0530 8.7286 10.7221 7.0314 7.7746 4.3163 3.7333 2.8447 3.0205 2.9467 2.8970 4.2495 3.9471 6.1143 4.9109 4.6624 4.9237 5.9063 6.9806 6.0015 6.5311 4.3988 4.5188 5.3602 5.3368 3.1629 3.4348 1.3662 1.2498 1.5663 1.6215 1.8613 2.1918 1.3855 3.7499 4.6361 1.3873 1.4756 1.3901 2.9210 3.4031 2.5708 2.4000 1.4087 1.3815 1.3126 1.2350 1.1250 1.1533 1.1942 1.1986 3.1144 3.3788 1.2739 1.2944 4.8379 5.0081 3.5572 4.2219 1.1640 1.1692 2.1886 2.0946 8.5215 8.3239 7.6534 6.5190 6.2134 6.8305 1.0582 1.0578 1.1002 1.0991 1.1074 1.0886 1.0884 1.0888 1.0945 1.0971 1.0963 1.0975
irintensity: 0.0188 0.1950 0.7818 0.2760 0.9818 2.5881 1.0732 0.6768 0.7965 4.7359 6.0755 7.9876 1.2823 0.7549 2.6197 2.1727 1.7809 7.9137 26.8505 0.9013 0.5329 4.7529 2.6011 16.3099 16.5256 14.6487 33.7061 4.8294 22.3027 4.4796 1.4474 2.5283 14.7834 2.5566 6.0750 36.8696 29.0632 27.6581 36.2339 6.9038 4.1546 30.0436 61.0903 2.9850 3.0522 0.4623 42.7952 125.1854 2.4039 4.9437 11.5182 0.9306 15.4340 32.6521 106.8758 1.2944 14.3959 27.5047 22.2942 28.0107 11.0113 4.3987 14.3960 356.2589 136.5562 9.9917 2.2011 12.7824 20.3960 35.5007 15.6845 51.8788 13.8970 19.1129 19.6376 233.3428 140.2411 55.5465 130.5725 150.5179 52.2338 6.1048 5.3616 15.7568 21.2690 1.7433 0.4591 5.4089 0.2058 1.7361 7.4718 5.9720 1.4909
temp: 298.150 k
press: 1.00000 atm
elementType: 35 35 16 8 8 6 6 6 6 6 6 6 6 6 6 6 6 6 6 6 6 1 1 1 1 1 1 1 1 1 1 1 1
symmnumber: 1
zpe: 613502.0 jmol-1
zpe.correction: 0.233671 hartree
zpe.thermalcorrener: 0.253863 hartree
zpe.thermalcorrenthalpy: 0.254807 hartree
zpe.thermalcorrgfe: 0.179306 hartree
zpe.sumelectzpe: -1190.843651 hartree
zpe.sumelectthermal: -1190.823459 hartree
zpe.sumelectthermalent: -1190.822515 hartree
zpe.sumelectthermalfe: -1190.898015 hartree
dipole: 2.3942 -1.9916 -1.1061
dipole: 3.3049
quadrupole: -151.7652 -162.8079 -143.9356
quadrupole: 2.9736 0.7834 -2.9109
quadrupole: 1.0710 -9.9717 8.9006 2.9736 0.7834 -2.9109
hfenergy: -1191.0773213 hartree
pointgroup: C01 [X(C16H12Br2O2S1)]
dipole: 1.1528303 -0.5833403 0.146082 debye
polarizability: 224.5789121|-52.4912675|372.7672375|-39.3101043|11.0072229|151.0445197 unknown
InChI: InChI=1S/C16H12Br2O2S/c17-13-5-1-11(2-6-13)15(19)9-21-10-16(20)12-3-7-14(18)8-4-12/h1-8H,9-10H2
charge 0 multiplicity 1
33 atoms
Br 0.020028 6.585258 0.291136
Br 3.635465 -6.555951 -0.836246
S  -1.57145 -1.125048 1.202122
O  -4.232376 1.076722 0.667685
O  0.747504 -0.219584 -1.252327
C  -2.403408 -0.199516 -0.24788
C  0.229003 -0.503816 1.080688
C  -2.249346 2.378355 0.244507
C  1.481491 -2.322341 -0.330389
C  -3.03703 1.100673 0.245618
C  0.833717 -0.978209 -0.230477
C  -0.984021 2.519118 -0.388991
C  1.467833 -3.269616 0.728842
C  -2.83046 3.508772 0.884778
C  2.140187 -2.65841 -1.54567
C  -0.313326 3.762545 -0.379426
C  2.099133 -4.521908 0.583753
C  -2.169115 4.74985 0.907816
C  2.780462 -3.901593 -1.703085
C  -0.911587 4.861009 0.271283
C  2.752434 -4.822175 -0.631198
H  -1.655369 -0.083295 -1.047835
H  -3.201571 -0.883451 -0.575022
H  0.225914 0.594753 1.126258
H  0.71514 -0.911352 1.979822
H  -0.502306 1.678818 -0.902492
H  0.945974 -3.054854 1.666287
H  -3.810216 3.388163 1.358357
H  2.138805 -1.924501 -2.357866
H  0.655945 3.868612 -0.874348
H  2.079042 -5.252236 1.397063
H  -2.618052 5.61358 1.406097
H  3.290456 -4.152474 -2.637158
