program: Gaussian 09
title: 000290033
version: EM64L-G09RevD.01
frameworkgroup: C1[X(C19H17NO4S)]
method: RPBEPBE
basis: SDD
operation: Freq
keyword: #p
keyword: freq=noraman
keyword: PBEPBE/SDD
title: #p freq=noraman PBEPBE/SDD
converged: YES YES NO NO
title: Mulliken charges:
elementType: S O O O O N C C C C C C C C C C C C C C C C C C C H H H H H H H H H H H H H H H H H
charge: 0.894424 -0.552254 -0.555106 -0.251080 -0.261395 -0.217769 0.406410 0.406832 -0.604281 -0.604648 -0.528922 0.229997 0.230037 -0.370635 -0.380522 -0.380519 -0.371000 0.316371 -0.228566 -0.218245 -0.218255 -0.228591 -0.230263 -0.230242 -0.498378 0.292679 0.292710 0.297815 0.297790 0.290214 0.266591 0.266474 0.290396 0.237466 0.236445 0.236411 0.237427 0.235652 0.235663 0.245704 0.245755 0.241408
chargesum: 0.00000
title: Mulliken charges with hydrogens summed into heavy atoms:
elementType: S O O O O N C C C C C C C C C C C C C C C C C C C
charge: 0.894424 -0.552254 -0.555106 -0.251080 -0.261395 -0.217769 0.406410 0.406832 -0.311602 -0.311938 0.066683 0.229997 0.230037 -0.080421 -0.113931 -0.114045 -0.080603 0.316371 0.008899 0.018200 0.018157 0.008836 0.005388 0.005421 0.234489
polarizability: 2.99303659e+02 -1.95310833e-02 2.78070707e+02 4.78614502e-02 -1.82915621e+01 1.78928901e+02
1716.lowfreq: -5.1200 -4.4506 0.0014 0.0015 0.0020 7.0609 13.7493 15.6631 44.5677
frequency: 13.2410 15.5871 44.5534 51.6421 52.7717 64.9268 75.7747 86.9334 88.6728 95.4160 126.9601 152.6821 165.9220 178.9772 199.1207 206.0517 230.9144 247.5821 266.2708 290.4890 296.5263 328.6978 332.4113 367.4433 388.5544 409.1062 409.7092 436.7707 449.8980 513.2969 519.9475 544.2802 599.2695 603.8557 611.1082 611.4703 633.8516 652.2167 685.1634 699.9837 705.7291 713.6700 731.5925 748.4140 761.8263 779.6432 784.6931 791.0788 796.4166 807.3263 842.0745 862.2513 863.3980 911.6357 937.7274 939.1341 953.2160 956.3618 977.9017 985.7739 986.0989 989.0368 990.4251 1002.9171 1003.0369 1027.6918 1035.0823 1083.0531 1083.2325 1115.3772 1119.2933 1144.0606 1152.2207 1175.2880 1175.3449 1189.0245 1191.5077 1195.2819 1195.4386 1229.8514 1250.4433 1318.5241 1320.0537 1321.0088 1350.6743 1372.2040 1373.1000 1380.3424 1423.3132 1430.7950 1431.0782 1440.4304 1455.1144 1462.5541 1479.8639 1482.1737 1560.4300 1580.1915 1584.0474 1604.1754 1607.4249 1609.5680 1659.9786 3009.2568 3035.2948 3092.6743 3113.9556 3130.3296 3130.3580 3138.1981 3138.2390 3150.0953 3150.1671 3157.0997 3163.1596 3163.3494 3172.9125 3173.1848 3211.2298 3212.3476
redmass: 4.7603 6.2995 5.1165 6.4823 4.2216 7.1587 4.8669 2.0838 1.6041 5.3960 4.5509 5.9637 4.8559 6.5582 6.0989 6.1654 9.3529 5.0490 4.4831 3.8480 4.7457 4.5274 5.9244 7.5675 5.8080 2.8901 2.9684 2.5909 9.1835 3.8050 3.6243 5.5120 6.2910 5.5084 6.4877 6.9265 5.7339 5.4607 5.4955 4.1238 2.2813 2.0628 2.5138 1.8129 1.9466 2.4208 5.0142 3.2605 1.5707 4.0418 6.0643 1.2371 1.2449 13.4697 1.4108 1.4038 6.5917 2.3820 5.0626 1.5498 1.4736 4.1331 4.8511 1.3144 1.3169 2.2988 1.9541 1.6212 1.6255 1.2625 1.9117 4.4438 1.5202 1.0548 1.0545 2.9696 1.4153 1.1663 1.1341 1.9174 1.4578 2.8886 1.3685 1.4104 1.4335 5.8279 6.4677 3.2551 1.1738 2.2245 2.2233 1.0984 1.0499 1.0507 2.2843 2.3201 8.7799 5.9623 6.1170 7.3846 5.9693 6.9860 9.2076 1.0294 1.0603 1.1011 1.1050 1.0853 1.0853 1.0889 1.0889 1.0938 1.0938 1.1051 1.0969 1.0969 1.0999 1.0998 1.0931 1.0947
irintensity: 0.1813 1.1304 0.4985 0.5047 0.4140 0.2519 1.1217 0.9490 0.7330 1.5887 0.9828 5.0645 11.5112 0.2387 1.6176 0.9969 1.3145 1.2845 27.4833 21.3246 1.2054 12.9936 7.0132 13.1706 12.4339 0.1074 0.1333 7.8397 12.6349 23.0861 3.0101 3.3686 1.3636 0.2113 0.1823 0.9713 1.1063 10.7021 2.3925 15.1460 8.4317 63.9688 56.6698 88.0720 31.6911 0.5586 43.6595 2.2310 4.6750 140.9424 2.4206 2.7750 0.2884 117.1343 12.0797 15.7027 34.0457 53.2461 8.3003 0.1676 1.9048 2.7404 0.0445 0.2643 1.8511 11.9429 8.1598 1.0381 11.0822 0.0135 10.0644 323.7859 48.5637 0.0024 0.0391 17.5775 0.1041 7.1474 2.8366 1.6206 33.9083 6.6686 0.0279 2.6993 5.2823 12.1676 0.5198 140.7434 23.5222 1.0361 17.3184 29.2393 13.6997 10.6777 3.0447 15.4794 19.5314 18.8782 1.0636 106.8443 0.1281 63.4170 128.2360 29.5642 8.6484 0.1583 19.8926 0.1418 0.4334 4.7849 4.4646 5.7585 30.0278 11.9792 22.7676 8.2450 22.9378 5.3014 2.5922 18.3184
temp: 298.150 k
press: 1.00000 atm
elementType: 16 8 8 8 8 7 6 6 6 6 6 6 6 6 6 6 6 6 6 6 6 6 6 6 6 1 1 1 1 1 1 1 1 1 1 1 1 1 1 1 1 1
symmnumber: 1
zpe: 828536.7 jmol-1
zpe.correction: 0.315573 hartree
zpe.thermalcorrener: 0.338949 hartree
zpe.thermalcorrenthalpy: 0.339893 hartree
zpe.thermalcorrgfe: 0.259828 hartree
zpe.sumelectzpe: -1485.936779 hartree
zpe.sumelectthermal: -1485.913403 hartree
zpe.sumelectthermalent: -1485.912459 hartree
zpe.sumelectthermalfe: -1485.992524 hartree
dipole: 0.0150 -11.5738 -1.7815
dipole: 11.7101
quadrupole: -120.6356 -177.9002 -159.2715
quadrupole: 0.0633 -0.0032 -4.5447
quadrupole: 31.9668 -25.2978 -6.6690 0.0633 -0.0032 -4.5447
hfenergy: -1486.2523521 hartree
pointgroup: C01 [X(C19H17N1O4S1)]
dipole: -0.0388023 4.6057531 -0.1052733 debye
polarizability: 299.3028729|0.0766832|271.7092451|0.1409391|30.4116172|185.2911493 unknown
InChI: InChI=1S/C19H17NO4S/c1-24-19(21)12-20-17(15-8-4-2-5-9-15)13-25(22,23)14-18(20)16-10-6-3-7-11-16/h2-11,13-14H,12H2,1H3
charge 0 multiplicity 1
42 atoms
S  0.031833 -3.583988 -0.379722
O  0.036158 -4.739029 0.78125
O  0.043541 -4.063334 -1.950171
O  -0.027673 3.346776 -0.507414
O  -0.025403 2.025284 1.410027
N  0.004105 -0.367644 -0.343923
C  -1.233376 -1.049198 -0.200164
C  1.251698 -1.027874 -0.189049
C  -1.362489 -2.409709 -0.111583
C  1.403206 -2.385977 -0.09867
C  -0.005491 1.009783 -0.879022
C  -2.502516 -0.248973 -0.137866
C  2.506599 -0.206308 -0.117722
C  -2.782556 0.618391 0.951478
C  3.497961 -0.381515 -1.120218
C  -3.482068 -0.436825 -1.149602
C  2.762714 0.669556 0.970715
C  -0.020335 2.132678 0.166333
C  -4.021117 1.293558 1.015475
C  4.71889 0.324788 -1.047931
C  -4.714955 0.249274 -1.085553
C  3.989525 1.365084 1.0430
C  -4.98721 1.11712 -0.003047
C  4.967363 1.200816 0.033662
C  -0.042722 4.564137 0.343988
H  -2.313509 -2.907237 0.082846
H  2.360842 -2.867169 0.104213
H  0.881508 1.164734 -1.515612
H  -0.889178 1.14902 -1.523787
H  -2.045221 0.743517 1.750012
H  3.304862 -1.069989 -1.950666
H  -3.270473 -1.119125 -1.980638
H  2.016425 0.785362 1.762297
H  -4.235677 1.946948 1.868169
H  5.474437 0.185241 -1.82851
H  -5.46128 0.100214 -1.873215
H  4.185845 2.024975 1.895083
H  -5.946989 1.642587 0.051779
H  5.917895 1.742138 0.094991
H  0.85449 4.58761 0.984276
H  -0.946066 4.571158 0.9760
H  -0.047091 5.401246 -0.366909
