program: Gaussian 09
title: 000290030
version: EM64L-G09RevD.01
frameworkgroup: C1[X(C17H18N2O2S)]
method: RPBEPBE
basis: SDD
operation: Freq
keyword: #p
keyword: freq=noraman
keyword: PBEPBE/SDD
title: #p freq=noraman PBEPBE/SDD
converged: YES YES NO NO
title: Mulliken charges:
elementType: S O O N N C C C C C C C C C C C C C C C C C H H H H H H H H H H H H H H H H H H
charge: 0.145790 -0.260804 -0.249625 -0.024632 -0.420042 0.081559 0.340058 -0.836708 -0.376910 -0.403553 0.455007 -0.228669 -0.257957 -0.243772 -0.767499 -0.420386 -0.360650 -0.191990 -0.193133 -0.265054 0.374378 -0.505033 0.285041 0.317250 0.258470 0.275468 0.224309 0.227887 0.299786 0.227380 0.294776 0.304285 0.223920 0.266407 0.223392 0.223236 0.227185 0.238348 0.247128 0.245355
chargesum: 0.00000
title: Mulliken charges with hydrogens summed into heavy atoms:
elementType: S O O N N C C C C C C C C C C C C C C C C C
charge: 0.145790 -0.260804 -0.249625 -0.024632 -0.120256 0.081559 0.340058 -0.234417 -0.118439 -0.128085 0.455007 -0.004360 -0.030070 -0.016392 -0.168439 -0.196466 -0.094243 0.031402 0.030103 -0.037869 0.374378 0.225798
polarizability: 3.75071703e+02 -4.97650695e+01 2.64570082e+02 -1.49344709e+01 -1.66957432e+01 1.33516161e+02
1716.lowfreq: -3.9175 -0.0011 0.0010 0.0016 2.0993 7.7981 15.4509 20.5052 39.3693
frequency: 14.8429 19.9212 39.3559 50.6721 51.1153 57.4646 68.2163 74.1765 95.1260 103.5580 137.2121 167.1181 184.8998 227.0230 237.9745 239.4977 263.4571 279.6163 301.6587 313.2587 371.6910 390.0673 406.7400 407.4984 462.5999 499.2893 507.2888 527.0341 557.8791 587.9952 613.4844 614.9050 626.5808 634.3872 664.1049 683.1495 694.6182 702.3321 723.6106 760.6961 763.6974 784.7600 802.9741 833.3117 849.9094 858.4522 900.5740 901.3187 915.6434 933.8513 966.3509 967.5050 982.0445 982.3508 987.4613 990.0057 998.2396 1002.2276 1020.1363 1036.3241 1079.2304 1087.7303 1106.2172 1113.2664 1142.9099 1149.3614 1168.5828 1169.5612 1173.8131 1177.5602 1200.6028 1208.9080 1236.2492 1265.4659 1273.0257 1303.9722 1326.3740 1330.4244 1378.8223 1387.6817 1420.7812 1426.3346 1429.1358 1438.2011 1445.2194 1453.0033 1462.3568 1484.7007 1485.9410 1506.6743 1534.3224 1581.8944 1602.2588 1608.2360 1614.9648 1633.6396 2998.4968 3008.4724 3037.4682 3112.2603 3116.3154 3122.8441 3130.3926 3130.6290 3134.3914 3135.9077 3142.7909 3143.0978 3155.3339 3157.4489 3163.8352 3169.3565 3182.8932 3349.8997
redmass: 5.0475 5.3375 3.8912 4.6775 4.6375 5.3737 5.9143 4.1788 1.3888 2.8467 4.9733 4.9890 5.2962 4.0002 5.1424 4.5422 7.5317 4.3289 3.3068 4.2615 4.1433 2.9838 2.9055 2.9193 3.7654 3.6874 3.1816 3.4990 4.9105 4.5989 5.7953 5.9458 1.8847 5.3041 5.5266 5.0649 1.9471 1.7690 5.3388 1.7767 2.5377 2.6374 5.1136 1.2623 2.4765 1.2551 1.9066 1.7795 2.5368 1.4287 1.3581 6.3761 3.4987 3.5670 1.3365 1.9134 1.3313 4.2974 2.1166 1.9127 1.6455 1.6077 1.7008 1.2824 2.1339 1.4409 1.0659 1.3131 1.2529 1.1062 1.1709 1.3820 1.2056 1.6681 2.7719 1.6904 1.3592 1.9696 6.2771 6.5867 1.1434 1.1464 1.8973 2.1853 1.3632 1.0496 1.0506 2.3555 2.2041 3.4323 2.3957 5.7164 4.6290 5.7800 6.2129 9.1522 1.0669 1.0294 1.0617 1.1048 1.0873 1.0849 1.0904 1.0869 1.0945 1.1026 1.0935 1.0936 1.1050 1.0968 1.0987 1.0984 1.0955 1.0759
irintensity: 0.5976 0.6021 0.0645 0.4479 0.5142 1.1154 3.3036 0.6649 0.7909 0.2508 1.3310 1.5053 11.0502 0.3383 3.3503 13.2551 5.3431 22.0280 0.4730 5.3731 4.4440 9.6459 0.1170 0.0521 2.5727 16.7795 25.2397 11.0570 10.0225 24.8340 1.0887 7.1571 61.8048 24.1600 2.0724 34.5910 50.9956 51.7246 3.7812 55.2714 68.6555 45.4942 6.5229 0.6232 3.6132 0.7237 8.4813 3.8558 28.5159 12.9814 0.0440 25.8133 0.5716 2.7372 1.3693 1.2375 2.3855 41.2625 9.9632 15.1777 13.2480 4.3375 250.1341 7.0310 42.0514 9.5794 0.2747 16.5747 11.6089 5.7447 2.7590 90.6054 23.5504 185.1224 78.1830 22.8597 8.9880 33.6761 3.1059 9.1230 9.1396 20.9486 19.1223 6.2514 41.3054 15.9010 13.4488 175.6126 17.0103 22.4419 319.4682 10.4439 8.7844 1.8424 168.0520 156.8963 11.2304 32.7255 8.3159 22.0250 13.4374 3.1044 15.5449 0.8247 3.9278 2.1536 29.3715 8.4260 15.7478 32.4338 39.7910 22.0997 4.6922 57.2627
temp: 298.150 k
press: 1.00000 atm
elementType: 16 8 8 7 7 6 6 6 6 6 6 6 6 6 6 6 6 6 6 6 6 6 1 1 1 1 1 1 1 1 1 1 1 1 1 1 1 1 1 1
symmnumber: 1
zpe: 823261.1 jmol-1
zpe.correction: 0.313564 hartree
zpe.thermalcorrener: 0.334954 hartree
zpe.thermalcorrenthalpy: 0.335898 hartree
zpe.thermalcorrgfe: 0.259491 hartree
zpe.sumelectzpe: -1315.003248 hartree
zpe.sumelectthermal: -1314.981857 hartree
zpe.sumelectthermalent: -1314.980913 hartree
zpe.sumelectthermalfe: -1315.057321 hartree
dipole: -1.7507 -1.7929 -0.6870
dipole: 2.5983
quadrupole: -118.7492 -127.1341 -138.2984
quadrupole: 5.0550 4.5529 -2.5112
quadrupole: 9.3113 0.9265 -10.2378 5.0550 4.5529 -2.5112
hfenergy: -1315.3168115 hartree
pointgroup: C01 [X(C17H18N2O2S1)]
dipole: -0.6118371 0.741302 0.3480787 debye
polarizability: 384.0902199|34.7467437|257.5409426|20.8376507|-3.4897014|131.5267837 unknown
InChI: InChI=1S/C17H18N2O2S/c1-21-17(20)13-22-12-16(14-8-4-2-5-9-14)19-18-15-10-6-3-7-11-15/h2-11,18H,12-13H2,1H3
charge 0 multiplicity 1
40 atoms
S  -0.683873 2.319101 -0.772331
O  -3.658735 3.077426 1.400688
O  -3.840009 1.418403 -0.222985
N  1.02483 -0.691227 -0.352886
N  1.902135 0.344042 -0.51994
C  -0.220794 -0.580345 -0.82077
C  -1.117438 -1.747256 -0.592074
C  -0.697384 0.59393 -1.646443
C  -0.559759 -3.024235 -0.285688
C  -2.534797 -1.630932 -0.670147
C  3.234419 0.231957 -0.060454
C  -1.387609 -4.14232 -0.073099
C  -3.360629 -2.757123 -0.454493
C  -2.796651 -4.01789 -0.159191
C  -1.648551 1.924377 0.807332
C  4.076032 1.373949 -0.143569
C  3.742815 -0.986269 0.462553
C  5.414082 1.294274 0.294065
C  5.0823 -1.048394 0.897021
C  5.928256 0.084202 0.816898
C  -3.140163 2.07785 0.581791
C  -5.117074 3.328009 1.267655
H  -0.002119 0.776521 -2.489867
H  -1.706666 0.441434 -2.047499
H  0.52856 -3.116011 -0.224707
H  -3.010613 -0.662649 -0.861324
H  -0.93678 -5.115601 0.152566
H  -4.448824 -2.642162 -0.513579
H  1.55335 1.28147 -0.775861
H  -3.44061 -4.889754 0.001385
H  -1.291338 2.617952 1.580822
H  -1.406998 0.886386 1.093153
H  3.683467 2.316021 -0.547206
H  3.080807 -1.853221 0.524463
H  6.055385 2.180277 0.226595
H  5.469811 -1.990483 1.301664
H  6.968081 0.024972 1.15499
H  -5.331381 4.121358 1.996541
H  -5.351423 3.653698 0.24059
H  -5.68291 2.409764 1.49694
