program: Gaussian 09
title: 000290029
version: EM64L-G09RevD.01
frameworkgroup: C1[X(C16H14N2O2S)]
method: RPBEPBE
basis: SDD
operation: Freq
keyword: #p
keyword: freq=noraman
keyword: PBEPBE/SDD
title: #p freq=noraman PBEPBE/SDD
converged: YES YES NO NO
title: Mulliken charges:
elementType: S O O N N C C C C C C C C C C C C C C C C H H H H H H H H H H H H H H
charge: 0.946026 -0.535493 -0.535125 -0.068386 -0.069035 -0.794901 -0.793296 0.138613 0.139417 0.339797 0.339154 -0.369820 -0.368580 -0.369238 -0.369653 -0.240861 -0.224419 -0.224431 -0.240350 -0.228371 -0.228492 0.313536 0.331090 0.312568 0.331056 0.264736 0.269098 0.268660 0.263384 0.234910 0.232637 0.232586 0.234859 0.234120 0.234204
chargesum: 0.00000
title: Mulliken charges with hydrogens summed into heavy atoms:
elementType: S O O N N C C C C C C C C C C C C C C C C
charge: 0.946026 -0.535493 -0.535125 -0.068386 -0.069035 -0.150274 -0.149672 0.138613 0.139417 0.339797 0.339154 -0.105084 -0.099481 -0.100578 -0.106269 -0.005951 0.008218 0.008154 -0.005491 0.005749 0.005712
polarizability: 4.11652408e+02 5.71182778e-02 2.23679359e+02 1.04833344e+01 -5.98557507e-02 1.12977627e+02
1716.lowfreq: -14.4519 -5.8667 -5.6939 -0.0005 0.0018 0.0025 37.3331 43.9965 50.9664
frequency: 37.2707 43.9946 50.8999 51.5729 71.5581 94.5336 136.8484 159.5349 160.7431 175.8360 199.0353 200.4159 253.4506 307.8577 318.9989 345.8013 354.7589 392.8776 402.6069 402.9672 410.5431 419.1539 449.4745 490.5688 510.7153 511.5782 588.8774 613.2551 613.8990 647.5779 655.0690 696.9512 697.1155 697.5228 741.1244 779.4540 779.6795 791.0772 799.2290 852.6245 852.7097 873.9550 875.8573 930.8669 931.3439 939.1175 970.0917 980.6069 980.8802 989.3357 989.7882 1001.5312 1001.6894 1015.6478 1027.7391 1042.5038 1080.0359 1090.1732 1105.0330 1106.7920 1137.6149 1174.8343 1175.5952 1176.0524 1182.3034 1196.9067 1197.4168 1297.0306 1324.2209 1325.2075 1337.5978 1382.2040 1383.1696 1424.9761 1426.3668 1436.6128 1436.6600 1459.0238 1467.9195 1489.2094 1496.4940 1583.6864 1584.3101 1609.5713 1609.8189 3065.1068 3065.6110 3129.3660 3129.4714 3135.8144 3135.9497 3148.6174 3148.6426 3161.4514 3161.5199 3163.7066 3164.5130 3172.2014 3172.3051
redmass: 5.4281 3.7575 4.9686 5.3131 8.6145 6.0706 9.2704 7.5892 8.0690 5.1981 6.9310 6.5104 7.9389 4.4332 4.4280 2.8505 9.1250 4.1390 2.8450 2.8642 5.2427 5.0079 6.6111 4.7656 4.2927 3.9572 4.1009 6.3822 6.3920 4.8820 5.8660 1.9903 1.7230 4.2937 4.3750 1.9403 2.0262 2.8281 8.0732 1.2642 1.2622 2.5063 3.1736 1.4258 1.4389 5.0722 2.3700 1.6297 1.5988 3.5889 3.8048 1.3330 1.3324 3.2950 2.0704 1.7748 1.8435 1.6081 1.4977 1.6779 2.5864 1.1367 1.0572 1.1205 1.1595 1.1231 1.1273 3.5651 1.3464 1.3916 3.6020 7.0415 7.3470 1.5597 1.7409 1.6558 1.5350 3.3904 5.5903 2.4351 3.0986 5.8548 5.8926 5.8616 5.8770 1.0578 1.0579 1.0860 1.0859 1.0888 1.0888 1.0928 1.0928 1.0967 1.0965 1.1093 1.1099 1.1006 1.1006
irintensity: 0.8401 0.0109 0.0411 0.7462 5.9944 0.0429 0.0216 8.7613 0.6145 0.0939 1.2709 8.5097 12.8107 2.1865 1.4557 7.7226 15.2442 1.4421 4.5796 0.1240 22.0292 2.2590 3.5783 12.9083 4.8378 1.4077 4.0263 0.5333 0.1592 28.5040 0.2100 108.8333 1.5005 25.2016 2.1713 88.6862 4.0141 18.2564 98.0276 0.6480 1.5445 0.8410 8.9339 0.2498 15.3352 79.9393 14.5074 3.2979 1.0389 0.1005 0.4495 1.5021 0.9259 58.3568 5.1089 11.1745 33.7423 0.5443 7.0740 9.2521 5.7607 12.6627 0.0407 3.4953 3.4047 17.0635 2.2548 158.0842 6.2600 19.6727 1.5540 3.0489 0.0034 19.0072 8.5702 77.9367 36.8973 44.4144 0.7984 0.9149 7.8597 0.4745 1.8837 8.8488 0.0465 3.1459 0.4262 1.2300 0.8177 2.2563 2.5210 13.6178 19.8597 25.1743 16.9661 0.5741 0.1322 42.2852 5.5130
temp: 298.150 k
press: 1.00000 atm
elementType: 16 8 8 7 7 6 6 6 6 6 6 6 6 6 6 6 6 6 6 6 6 1 1 1 1 1 1 1 1 1 1 1 1 1 1
symmnumber: 1
zpe: 687624.4 jmol-1
zpe.correction: 0.261902 hartree
zpe.thermalcorrener: 0.280358 hartree
zpe.thermalcorrenthalpy: 0.281302 hartree
zpe.thermalcorrgfe: 0.214389 hartree
zpe.sumelectzpe: -1274.442610 hartree
zpe.sumelectthermal: -1274.424155 hartree
zpe.sumelectthermalent: -1274.423210 hartree
zpe.sumelectthermalfe: -1274.490123 hartree
dipole: 0.0272 -2.9195 0.0060
dipole: 2.9196
quadrupole: -102.3824 -141.8617 -132.2821
quadrupole: 0.0489 -3.4966 -0.0924
quadrupole: 23.1263 -16.3530 -6.7734 0.0489 -3.4966 -0.0924
hfenergy: -1274.7045123 hartree
pointgroup: C01 [X(C16H14N2O2S1)]
dipole: -0.0095831 -0.9469526 0.6500925 debye
polarizability: 411.1756957|9.1088694|188.2120334|13.0030432|-51.4923942|148.9216653 unknown
InChI: InChI=1S/C16H14N2O2S/c19-21(20)11-15(13-7-3-1-4-8-13)17-18-16(12-21)14-9-5-2-6-10-14/h1-10H,11-12H2
charge 0 multiplicity 1
35 atoms
S  0.005173 1.758884 -1.231565
O  1.166442 2.887557 -1.028479
O  -1.149688 1.976648 -2.363721
N  0.675426 -1.029883 0.78763
N  -0.669749 -1.11341 0.667515
C  0.870425 -0.071903 -1.474268
C  -0.866365 1.340664 0.565422
C  1.452016 -0.521164 -0.181954
C  -1.446979 -0.027406 0.531422
C  2.912758 -0.452225 0.059475
C  -2.907544 -0.231224 0.382443
C  3.707825 0.525919 -0.600164
C  -3.517992 -1.412732 0.888188
C  3.528056 -1.346718 0.978996
C  -3.707536 0.732204 -0.292921
C  5.093856 0.599029 -0.346298
C  -4.902484 -1.619035 0.732157
C  4.913363 -1.271713 1.222487
C  -5.092931 0.51567 -0.450617
C  5.702742 -0.30142 0.557872
C  -5.696593 -0.654025 0.065615
H  1.586146 0.09476 -2.28961
H  -0.01055 -0.645514 -1.801714
H  -1.582826 2.162077 0.694562
H  0.01338 1.446203 1.219068
H  3.243486 1.263311 -1.264834
H  -2.89329 -2.149539 1.402377
H  2.90677 -2.092489 1.484336
H  -3.248537 1.620117 -0.74262
H  5.6957 1.365053 -0.846776
H  -5.365651 -2.526938 1.133635
H  5.380846 -1.970853 1.924383
H  -5.698405 1.255437 -0.985061
H  6.780681 -0.246876 0.745742
H  -6.773974 -0.814264 -0.051729
