program: Gaussian 09
title: 000290023
version: EM64L-G09RevD.01
frameworkgroup: C1[X(C8H12O3S)]
method: RPBEPBE
basis: SDD
operation: Freq
keyword: #p
keyword: freq=noraman
keyword: PBEPBE/SDD
title: #p freq=noraman PBEPBE/SDD
converged: YES YES NO NO
title: Mulliken charges:
elementType: S O O O C C C C C C C C H H H H H H H H H H H H
charge: 0.194482 -0.270320 -0.180024 -0.226567 0.126042 -0.756647 0.183619 -0.478383 -0.714762 -0.673674 0.241045 -0.501257 0.289353 0.269299 0.243802 0.282976 0.229130 0.245032 0.237017 0.263848 0.268200 0.244806 0.248060 0.234923
chargesum: 0.00000
title: Mulliken charges with hydrogens summed into heavy atoms:
elementType: S O O O C C C C C C C C
charge: 0.194482 -0.270320 -0.180024 -0.226567 0.126042 -0.197995 0.183619 0.048395 -0.003582 -0.141627 0.241045 0.226532
polarizability: 1.13754465e+02 -4.35372730e+00 1.09160298e+02 9.59873439e+00 3.03479096e+00 9.54993615e+01
1716.lowfreq: -10.5410 -0.0024 -0.0020 -0.0015 13.6887 16.1770 54.3770 73.3603 84.9369
frequency: 54.2721 73.3450 84.7206 104.6984 134.9179 153.5754 187.6139 214.9337 246.0323 270.5153 273.1082 313.8894 324.7248 362.8756 387.7478 452.4604 507.6819 569.5143 633.2518 683.3999 703.9162 710.7798 730.8031 785.0868 823.0477 903.3055 927.9886 953.1407 983.0684 992.5342 1060.7789 1083.4303 1113.3536 1114.7131 1131.1733 1146.6806 1155.6229 1159.5695 1223.7232 1262.2094 1274.0382 1290.9539 1310.6051 1384.2593 1420.3424 1429.9614 1447.3737 1451.4131 1453.1132 1460.0159 1463.3959 1472.2317 1624.0893 1628.1816 3003.5270 3008.2679 3011.5036 3020.0369 3023.5639 3080.5706 3101.2011 3105.1832 3111.7460 3112.6878 3115.3691 3153.0872
redmass: 5.1825 4.8942 5.3941 1.2053 3.6994 3.2817 1.0356 3.2516 3.6322 2.9940 2.5483 4.7130 3.7462 5.4891 5.5235 3.6800 3.6240 4.4421 4.5134 5.7827 4.3529 4.0048 4.1483 3.5252 1.7660 2.4437 2.0707 2.4892 2.3585 1.9231 3.3314 2.4257 1.2804 1.3837 1.8822 1.7246 1.7842 1.9086 1.4038 1.4252 1.7065 1.4040 1.4754 1.1776 1.1546 1.1061 1.0848 1.0865 1.0501 1.0533 1.0514 1.0556 9.8748 10.2753 1.0343 1.0292 1.0581 1.0609 1.0604 1.1020 1.1062 1.0997 1.1030 1.1048 1.1029 1.1051
irintensity: 1.2661 1.0404 5.6920 0.1972 1.8618 1.5105 0.1873 2.1470 14.2228 1.9118 1.1614 5.9155 1.7427 9.4859 1.3889 5.3796 8.0460 6.0934 3.3526 3.2473 4.9025 3.0052 4.6785 9.5561 6.9514 4.9089 5.3162 12.0600 20.6609 1.0695 3.0048 174.0696 7.3172 63.9540 4.7666 21.5846 9.9333 68.0372 6.6374 6.0358 45.0145 12.0203 21.3896 17.5111 7.0003 18.3038 10.8627 27.9488 15.5965 10.5308 14.1945 21.0593 117.9599 169.7402 13.5973 31.5145 7.1968 35.8080 19.5871 8.7376 7.5397 14.8327 6.0876 20.4380 9.0694 13.5300
temp: 298.150 k
press: 1.00000 atm
elementType: 16 8 8 8 6 6 6 6 6 6 6 6 1 1 1 1 1 1 1 1 1 1 1 1
symmnumber: 1
zpe: 496180.6 jmol-1
zpe.correction: 0.188985 hartree
zpe.thermalcorrener: 0.202142 hartree
zpe.thermalcorrenthalpy: 0.203086 hartree
zpe.thermalcorrgfe: 0.149333 hartree
zpe.sumelectzpe: -934.839905 hartree
zpe.sumelectthermal: -934.826749 hartree
zpe.sumelectthermalent: -934.825804 hartree
zpe.sumelectthermalfe: -934.879557 hartree
dipole: 1.4113 -1.8173 1.1936
dipole: 2.5921
quadrupole: -67.2025 -88.7915 -79.2051
quadrupole: 2.7325 2.1868 5.3291
quadrupole: 11.1972 -10.3918 -0.8054 2.7325 2.1868 5.3291
hfenergy: -935.0288906 hartree
pointgroup: C01 [X(C8H12O3S1)]
dipole: 0.6085324 0.6942813 -0.4332047 debye
dipolederiv: -0.1977009 0.0729733 0.0285265 0.1141291 -0.2069605 0.05835 -0.0009667 0.0586343 -0.2073797 -1.2982152 -0.3571603 0.0430287 -0.3943073 -0.4359719 0.0430436 0.1228951 0.0981197 -0.4998725 -0.5193806 -0.2519767 0.0837828 -0.1807921 -0.8204528 -0.0516967 0.1063655 -0.1292094 -0.3133795 -0.6236048 -0.0487181 -0.1407086 -0.1071457 -0.3360497 0.0847052 0.1813212 0.1999144 -0.8259342 -0.2341337 -0.1206217 0.0621074 -0.123612 -0.1686089 -0.0434252 0.0916109 -0.0499803 -0.2208557 0.0320407 -0.1996813 0.0148478 -0.1208065 0.2723116 0.0455507 0.0185315 0.0685643 0.176479 0.7088294 0.2896357 -0.3206969 0.2396983 0.9193027 0.1566895 -0.3739547 0.2544361 0.2564657 -0.1086937 0.0971928 0.1261083 0.0557166 -0.3058681 -0.0702972 0.0918378 -0.0890325 -0.1017019 -0.0390934 0.0138398 -0.035751 0.0842515 -0.0285859 -0.0048025 -0.0401958 0.0352818 0.0464388 0.2848757 0.0807141 -0.049436 0.0439506 0.1765446 -0.0634625 -0.0613761 -0.1742857 0.1693786 1.3806951 0.3688759 0.0885103 0.4562102 0.4149282 -0.154087 -0.2533161 -0.2841394 1.0204246 0.6069788 0.1070529 0.0633415 0.1048915 0.2869826 0.0320044 0.1612006 0.0510886 0.2454513 0.0284273 -0.0179784 0.10185 -0.0039909 0.037649 -0.0038976 0.0868826 0.0088946 0.0506063 -0.0224816 -0.001721 -0.1179583 0.0078287 -0.0216228 -0.091102 -0.0695721 -0.0470227 -0.0225302 -0.0425102 -0.024763 0.0889115 -0.0822326 0.0153801 0.0769494 0.0854046 0.0296308 0.0428032 0.0819192 -0.0041391 -0.0915728 -0.0302874 0.073641 -0.0277653 -0.0622299 -0.0266938 0.0642126 -0.0381122 -0.0196991 0.101201 -0.0564736 0.0743535 0.0498778 0.0996656 0.0034874 0.0386844 0.0884977 0.0423472 -0.0128482 0.0743992 -0.0502771 0.047218 -0.0186488 0.0888468 0.0227538 -0.0072212 -0.0323213 -0.1122595 -0.024337 0.0780038 -0.0420146 -0.0963003 -0.0454438 -0.0036527 -0.0883707 -0.0248817 -0.0442895 -0.1074753 0.0318527 -0.0051779 -0.0884842 0.0326256 -0.0310587 0.0288547 0.0473678 0.0595185 0.0600841 -0.0297173 -0.0568332 0.0794086 -0.0647966 0.020813 0.0016548 -0.0025805 -0.0322677 0.0679833 -0.0507499 0.0709796 -0.1161541 0.04319 0.0488674 0.0054134 0.0486329 0.0434817 -0.0029893 -0.012138 -0.0849886 -0.0485659 -0.1142095 0.0111183 -0.0286686 -0.0623902 0.0525723 -0.0746935 0.086053 0.0341821 0.1046409 0.0520994 0.0118679 unknown
polarizability: 114.9350653|4.0934998|108.6348901|-8.5466412|3.882628|94.8441697 unknown
InChI: InChI=1S/C8H12O3S/c1-8(7(10)11-2)5-12-4-3-6(8)9/h3-5H2,1-2H3
charge 0 multiplicity 1
24 atoms
S  -0.830067 2.22146 -0.546411
O  2.231031 0.387471 -0.285271
O  -1.788566 -2.052338 0.03982
O  1.14839 -0.392096 1.616818
C  0.021128 -0.53012 -0.605208
C  -0.305064 0.692425 -1.518346
C  -1.262783 -0.920558 0.190317
C  -1.895229 0.139056 1.090314
C  0.497241 -1.718651 -1.485477
C  -2.30792 1.41017 0.307647
C  1.146453 -0.171114 0.384439
C  3.389574 0.760551 0.564157
H  0.594601 0.990053 -2.078425
H  -1.110132 0.427576 -2.226446
H  -2.784862 -0.31268 1.565397
H  -1.172516 0.413795 1.879106
H  1.397596 -1.43238 -2.054351
H  0.724194 -2.599412 -0.861834
H  -0.303765 -2.012831 -2.184385
H  -3.069234 1.181406 -0.458405
H  -2.710932 2.175395 0.990926
H  3.766314 -0.124037 1.103866
H  3.087057 1.531773 1.291707
H  4.13839 1.149287 -0.139557
