program: Gaussian 09
title: 000290020
version: EM64L-G09RevD.01
frameworkgroup: C1[X(C15H17NO2S2)]
method: RPBEPBE
basis: SDD
operation: Freq
keyword: #p
keyword: freq=noraman
keyword: PBEPBE/SDD
title: #p freq=noraman PBEPBE/SDD
converged: YES YES NO NO
title: Mulliken charges:
elementType: S S O O N C C C C C C C C C C C C C C C H H H H H H H H H H H H H H H H H
charge: 0.493504 0.902163 -0.574906 -0.536037 -0.610062 -0.035946 -0.557028 -0.120850 -0.251051 -0.234525 0.451869 -0.366479 -0.368868 -0.647352 -0.170897 -0.253648 -0.802472 -0.229423 -0.215518 -0.217951 0.275168 0.328189 0.286307 0.271596 0.239434 0.237644 0.235157 0.237034 0.243389 0.321239 0.257076 0.226333 0.227604 0.241700 0.240257 0.239591 0.237759
chargesum: 0.00000
title: Mulliken charges with hydrogens summed into heavy atoms:
elementType: S S O O N C C C C C C C C C C C C C C C
charge: 0.493504 0.902163 -0.574906 -0.536037 -0.610062 -0.035946 0.046329 -0.120850 0.035256 0.037071 0.451869 -0.127045 -0.131224 0.068228 0.150342 0.003428 -0.106834 0.010834 0.024073 0.019809
polarizability: 3.14571767e+02 -1.60650609e+01 2.09673472e+02 -1.01532451e+00 -5.84787616e+00 1.72273977e+02
1716.lowfreq: -7.7107 -5.8344 -0.0020 -0.0015 -0.0005 2.3420 14.7761 23.8572 27.4987
frequency: 14.3723 23.6353 27.4377 40.5427 50.3119 51.3132 64.4234 87.2201 116.4932 127.3738 143.2389 144.3135 150.0929 215.6172 219.1712 235.0541 261.7272 277.2909 292.5980 311.9487 353.1288 373.4940 388.4620 392.5838 407.8549 408.0204 467.6183 486.0570 502.6611 535.2761 576.6117 593.1126 606.5112 622.8817 624.3014 667.8975 696.5588 711.4695 755.0936 774.8270 781.3107 792.7397 826.6572 850.2627 855.4924 905.4102 935.6011 959.4303 980.3899 980.8471 982.1596 984.9938 989.0004 997.9205 1005.4426 1013.7807 1048.8114 1053.7047 1057.8453 1059.1999 1066.3613 1078.1712 1115.0735 1173.6587 1180.0167 1181.6140 1217.7066 1228.6944 1271.0793 1293.6784 1305.1997 1381.5953 1381.9264 1391.0999 1394.4245 1396.9338 1431.9514 1441.3471 1458.5889 1468.6499 1471.7665 1474.3262 1474.6154 1479.8719 1585.0717 1596.1219 1596.5840 1598.0999 2978.0825 2985.0080 3024.5030 3060.3146 3074.5865 3086.9927 3088.7938 3122.6025 3131.1288 3133.0583 3133.7169 3139.6808 3146.5877 3158.4193 3160.2261 3163.5210 3171.5902
redmass: 4.9905 3.9910 4.6868 3.6513 1.0178 6.9068 2.8689 4.9080 2.2272 5.9139 6.0207 6.6810 7.3037 1.4578 7.4745 3.0601 6.1672 3.4143 4.9137 4.6221 4.9245 8.2535 5.1987 9.7602 2.8748 2.9118 6.0508 3.8889 3.4380 4.8663 10.0767 6.4351 6.7733 8.4472 9.5643 6.8265 2.4542 3.2803 1.3610 6.0567 1.1609 8.2876 1.3966 1.2513 1.2383 16.8408 1.3480 1.3182 1.4135 1.7596 3.9205 1.4252 1.3965 5.0962 1.3416 3.6050 1.5888 1.8356 1.7316 2.2050 2.1151 1.6108 1.2786 1.0641 1.1230 1.1403 2.9665 1.2250 1.2215 1.2667 1.3041 6.2750 9.2613 3.0679 1.2000 1.2224 2.1386 1.1055 2.0267 1.0422 1.0976 1.4902 1.4502 1.0502 5.9017 6.6576 6.9802 6.1214 1.0386 1.0360 1.0597 1.0950 1.0970 1.1020 1.0999 1.1084 1.0892 1.0893 1.0858 1.0889 1.0927 1.0968 1.0951 1.0964 1.1016
irintensity: 2.3655 0.1963 1.2564 1.0331 0.5469 0.2802 0.5328 0.8366 1.2674 0.9105 4.2167 1.3642 6.3101 0.9088 11.6420 0.6816 2.4111 1.2969 16.9397 2.7163 7.4189 16.5748 1.1981 12.5596 0.1159 0.3545 58.2427 19.6041 39.4393 7.0617 24.7662 13.2097 25.1343 77.1806 121.1616 9.8683 29.5845 0.6671 71.4400 37.0201 14.9245 91.2165 23.4823 1.8526 0.1138 103.0137 3.1813 0.4056 2.7184 24.8110 6.6944 1.3727 1.0404 3.3478 1.0099 16.5577 25.1043 5.6914 15.1597 15.9689 6.9623 6.7781 8.2244 4.2486 21.6248 4.2804 5.9090 6.0020 12.2043 2.3199 5.5781 0.4324 1.9171 8.9449 20.1040 13.5601 12.5540 10.7248 47.8333 10.3042 15.9858 17.2211 17.8473 8.5679 11.5918 1.7788 0.2746 9.9949 32.7534 21.9318 7.2943 19.8928 12.1275 15.8170 16.5206 8.2642 16.7160 12.8374 1.6142 8.6763 1.7654 13.8849 3.4234 9.9436 30.2617
temp: 298.150 k
press: 1.00000 atm
elementType: 16 16 8 8 7 6 6 6 6 6 6 6 6 6 6 6 6 6 6 6 1 1 1 1 1 1 1 1 1 1 1 1 1 1 1 1 1
symmnumber: 1
zpe: 740205.2 jmol-1
zpe.correction: 0.281929 hartree
zpe.thermalcorrener: 0.303587 hartree
zpe.thermalcorrenthalpy: 0.304531 hartree
zpe.thermalcorrgfe: 0.227540 hartree
zpe.sumelectzpe: -1581.399279 hartree
zpe.sumelectthermal: -1581.377622 hartree
zpe.sumelectthermalent: -1581.376677 hartree
zpe.sumelectthermalfe: -1581.453668 hartree
dipole: 4.1299 4.8490 4.6305
dipole: 7.8747
quadrupole: -90.8472 -134.8202 -137.3542
quadrupole: -11.9768 -2.9651 -7.7905
quadrupole: 30.1600 -13.8130 -16.3470 -11.9768 -2.9651 -7.7905
hfenergy: -1581.6812081 hartree
pointgroup: C01 [X(C15H17N1O2S2)]
dipole: 1.6416268 -1.7049514 -1.999171 debye
polarizability: 314.535586|15.8018265|210.4619365|4.0029572|-1.6306924|171.5216926 unknown
InChI: InChI=1S/C15H17NO2S2/c1-3-19(14-7-5-4-6-8-14)16-20(17,18)15-11-9-13(2)10-12-15/h4-12H,3H2,1-2H3
charge 0 multiplicity 1
37 atoms
S  1.956834 1.039844 0.70867
S  -0.933685 1.321665 1.190434
O  -0.8096 2.762293 0.395674
O  -1.070353 1.363339 2.818632
N  0.352574 0.154629 0.533358
C  -2.417753 0.373385 0.522964
C  2.083843 1.931235 -1.018885
C  3.065154 -0.437587 0.43004
C  -3.113215 -0.466594 1.405916
C  -2.801854 0.572484 -0.812149
C  -4.676709 -0.985166 -0.430525
C  -4.248482 -1.147828 0.913539
C  -3.941063 -0.117698 -1.281718
C  3.424147 2.635939 -1.216627
C  2.497463 -1.645817 -0.015617
C  4.441182 -0.295856 0.700377
C  -5.919666 -1.694486 -0.937715
C  3.354854 -2.751671 -0.215401
C  5.284876 -1.412751 0.493205
C  4.743183 -2.635407 0.033206
H  1.882782 1.127021 -1.7447
H  1.216365 2.610789 -0.950469
H  -2.781071 -0.562373 2.44479
H  -2.238915 1.259628 -1.451616
H  -4.808902 -1.81197 1.581899
H  -4.263923 0.019861 -2.320379
H  3.613969 3.384906 -0.427537
H  4.268716 1.925153 -1.249492
H  3.405098 3.172999 -2.183511
H  1.414108 -1.704443 -0.167609
H  4.849373 0.646886 1.080354
H  -5.859046 -1.89622 -2.021443
H  -6.080154 -2.655099 -0.417814
H  -6.821829 -1.074978 -0.768743
H  2.935197 -3.703567 -0.557456
H  6.356431 -1.326098 0.701158
H  5.399768 -3.498645 -0.120312
