program: Gaussian 09
title: 000290017
version: EM64L-G09RevD.01
frameworkgroup: C1[X(C5H7NOS)]
method: RPBEPBE
basis: SDD
operation: Freq
keyword: #p
keyword: freq=noraman
keyword: PBEPBE/SDD
title: #p freq=noraman PBEPBE/SDD
converged: YES YES NO NO
title: Mulliken charges:
elementType: S O N C C C C C H H H H H H H
charge: 0.240143 -0.240540 -0.387337 0.557890 -0.757101 0.172681 -0.689945 -0.776714 0.292228 0.291666 0.327894 0.254878 0.240815 0.229250 0.244192
chargesum: 0.00000
title: Mulliken charges with hydrogens summed into heavy atoms:
elementType: S O N C C C C C
charge: 0.240143 -0.240540 -0.059443 0.557890 -0.173207 0.172681 -0.435067 -0.062457
polarizability: 9.60952693e+01 -2.58064725e+00 9.28344256e+01 9.67923792e-01 -9.48650058e-01 4.58148931e+01
1716.lowfreq: -15.5819 -7.8364 -0.0024 0.0022 0.0035 8.1202 112.8527 144.5642 163.0055
frequency: 112.8512 144.5629 163.0030 234.5465 291.3499 347.3711 405.1347 467.9383 529.1788 550.8253 560.6118 686.2916 727.4818 757.9379 783.1374 849.5778 907.6776 985.0701 1018.8046 1048.5938 1149.2398 1163.9257 1245.0502 1290.0859 1323.3568 1403.4137 1420.0280 1424.3645 1464.3861 1470.3420 1623.4740 1662.7341 2970.1787 3024.4847 3044.8748 3108.0318 3141.1941 3201.2982 3513.6626
redmass: 3.2713 3.3497 1.2766 2.8827 3.1953 4.0840 6.8328 4.8588 3.9196 3.0146 4.2965 1.5519 4.1395 1.5537 2.5347 4.2485 1.9298 3.6019 1.5633 1.4835 1.1497 1.7631 1.2630 1.5823 4.2935 1.2522 1.2890 1.5550 1.0463 1.0907 6.2965 5.9444 1.0390 1.0636 1.0979 1.0966 1.1004 1.0932 1.0760
irintensity: 5.0643 0.2616 0.3020 0.5081 1.7509 1.4830 6.5993 9.9335 1.7007 14.0998 4.5629 99.5934 7.8265 47.2137 21.7618 7.0443 7.8086 5.3056 3.8420 9.6911 17.0037 16.7037 17.9077 10.3572 111.8718 15.3731 25.1056 15.8469 16.2190 16.2713 376.0319 5.3989 38.1582 14.0553 21.0328 14.8453 0.6118 6.4793 27.7443
temp: 298.150 k
press: 1.00000 atm
elementType: 16 8 7 6 6 6 6 6 1 1 1 1 1 1 1
symmnumber: 1
zpe: 300358.8 jmol-1
zpe.correction: 0.114401 hartree
zpe.thermalcorrener: 0.122380 hartree
zpe.thermalcorrenthalpy: 0.123324 hartree
zpe.thermalcorrgfe: 0.081715 hartree
zpe.sumelectzpe: -722.159326 hartree
zpe.sumelectthermal: -722.151347 hartree
zpe.sumelectthermalent: -722.150403 hartree
zpe.sumelectthermalfe: -722.192012 hartree
dipole: -3.6752 0.5007 1.1681
dipole: 3.8887
quadrupole: -51.5617 -59.8525 -55.8558
quadrupole: 7.1192 2.3544 0.2288
quadrupole: 4.1950 -4.0958 -0.0992 7.1192 2.3544 0.2288
hfenergy: -722.2737271 hartree
pointgroup: C01 [X(C5H7N1O1S1)]
dipole: 1.4460554 0.1721739 0.4690427 debye
dipolederiv: -0.273324 -0.1827347 -0.0090133 -0.0173444 -0.1258478 0.0729666 -0.0430273 -0.0364812 -0.0016582 -1.0620142 0.3118299 -0.0162513 0.4677561 -0.7258887 0.0526197 -0.140665 0.1623518 -0.3643068 -1.2163461 0.3557049 -0.0220752 -0.2748695 -0.3261216 -0.019252 0.0570117 -0.0486539 -0.3356475 0.4782808 -0.4042347 0.0627507 -0.2451592 0.4279307 0.0232916 0.0828715 -0.0952462 0.0192762 0.1412836 -0.1395689 -0.1010575 -0.0965189 -0.2298211 0.1259985 -0.0370069 0.1433086 0.144243 1.6174015 -0.3124136 0.0327476 -0.0792215 0.7051818 -0.1871919 0.0438803 -0.2846357 0.2095826 0.1629019 0.3534936 0.1082414 0.2689409 -0.0642382 -0.0122896 0.0742825 0.071434 -0.3542747 -0.0546694 0.0401874 -0.0104678 -0.0806259 -0.0044148 -0.0151043 -0.0208065 -0.03634 0.1068249 0.0697608 0.0211415 -0.0328858 0.0411332 0.0555123 -0.0631574 0.0511169 -0.0010258 -0.0932791 -0.0255035 -0.0379963 -0.0020506 0.0093334 0.0839303 -0.0210393 -0.0097785 -0.0182085 0.1156134 0.1523827 0.0088281 0.0129638 -0.0021749 0.1723961 0.038058 -0.0157669 0.0911572 0.3079895 -0.063872 0.0048589 -0.0189281 0.00405 0.0712392 0.0010791 -0.0421686 0.0561463 0.209965 0.0540945 -0.0382944 0.0331793 -0.0624556 -0.0082749 -0.1042801 -0.0280867 -0.1358704 -0.0582464 0.0604117 -0.0347742 -0.0292218 -0.0802861 -0.0498287 0.1081418 0.0278238 0.1372023 -0.0272342 -0.0407882 0.0539722 -0.0079314 0.1474425 0.0182456 0.0001593 0.0003198 -0.0051385 0.1211524 unknown
polarizability: 97.1866098|-1.334785|91.5955894|-1.1980854|2.6985622|45.9623888 unknown
InChI: InChI=1S/C5H7NOS/c1-4-2-8-3-5(7)6-4/h2,6H,3H2,1H3
charge 0 multiplicity 1
15 atoms
S  -0.235034 -2.108501 -0.358645
O  -2.254047 1.276574 -0.209039
N  0.047839 0.98566 -0.148879
C  1.25873 0.243014 -0.033662
C  -1.410676 -0.907766 0.514988
C  -1.260896 0.521966 0.002641
C  1.272062 -1.118622 -0.112764
C  2.504456 1.08148 0.153272
H  -1.205981 -0.948647 1.599411
H  -2.434586 -1.250628 0.312977
H  0.117501 1.979508 -0.388747
H  2.199447 -1.688573 -0.045258
H  2.467299 1.656306 1.098219
H  2.626335 1.805728 -0.67656
H  3.402451 0.444303 0.174046
