program: Gaussian 09
title: 000290014
version: EM64L-G09RevD.01
frameworkgroup: C1[X(C5H7NO3S)]
method: RPBEPBE
basis: SDD
operation: Freq
keyword: #p
keyword: freq=noraman
keyword: PBEPBE/SDD
title: #p freq=noraman PBEPBE/SDD
converged: NO YES NO NO
title: Mulliken charges:
elementType: S O O O N C C C C C H H H H H H H
charge: 0.936726 -0.540867 -0.533079 -0.200970 -0.390291 -0.659933 -0.565576 0.531760 0.175426 -0.768774 0.307297 0.315071 0.291128 0.345584 0.247677 0.258082 0.250739
chargesum: 0.00000
title: Mulliken charges with hydrogens summed into heavy atoms:
elementType: S O O O N C C C C C
charge: 0.936726 -0.540867 -0.533079 -0.200970 -0.044707 -0.037566 -0.274448 0.531760 0.175426 -0.012276
polarizability: 1.14007486e+02 -6.73347306e+00 1.02436583e+02 -3.25920542e+00 2.25658628e+00 6.90034784e+01
1716.lowfreq: -10.7673 -3.7285 -0.0002 0.0016 0.0027 8.0558 73.3385 99.5570 143.4777
frequency: 73.3360 99.5569 143.4730 149.2703 187.0741 235.4633 250.6032 302.7137 320.2156 375.9705 391.3227 465.4875 499.0176 519.8324 569.6415 668.4122 720.4321 730.0462 750.1773 790.1892 840.5531 865.5066 940.7790 990.5405 1016.8920 1048.3233 1119.5698 1134.6343 1207.1710 1265.1347 1295.4783 1386.1599 1398.5402 1433.6430 1463.1412 1466.5258 1626.0562 1652.9613 2984.2928 3053.3421 3065.4771 3124.9998 3163.5982 3221.6292 3505.8528
redmass: 5.6830 4.0693 3.6657 1.2686 3.7858 4.8717 5.8528 4.6632 4.5181 5.7994 10.2493 4.9520 6.4713 2.7723 3.4463 2.6127 1.8104 3.7996 1.3058 8.3789 3.9515 2.6472 7.4956 4.4462 1.4494 1.5206 1.1864 1.5297 1.3033 2.1541 3.7527 1.0922 1.2237 1.7390 1.0794 1.1143 7.5564 4.9924 1.0389 1.0584 1.0983 1.0975 1.1070 1.0958 1.0763
irintensity: 5.4569 1.5268 0.3076 0.2940 6.3707 4.8195 3.8971 19.1145 6.0425 20.1904 13.0985 22.1953 8.2699 12.4689 0.7692 31.0698 48.7025 11.2288 70.5065 79.0240 7.4938 29.6986 98.9606 0.2171 0.7599 11.4577 16.2485 20.8915 14.6938 28.7465 132.2075 22.6257 17.8954 55.5890 16.5237 11.6807 362.0658 64.0475 13.0658 1.4403 9.4988 8.1525 2.5709 12.9823 43.8212
temp: 298.150 k
press: 1.00000 atm
elementType: 16 8 8 8 7 6 6 6 6 6 1 1 1 1 1 1 1
symmnumber: 1
zpe: 314097.7 jmol-1
zpe.correction: 0.119634 hartree
zpe.thermalcorrener: 0.130098 hartree
zpe.thermalcorrenthalpy: 0.131043 hartree
zpe.thermalcorrgfe: 0.083667 hartree
zpe.sumelectzpe: -872.274985 hartree
zpe.sumelectthermal: -872.264520 hartree
zpe.sumelectthermalent: -872.263576 hartree
zpe.sumelectthermalfe: -872.310952 hartree
dipole: -6.4757 -2.8471 -2.0100
dipole: 7.3539
quadrupole: -70.9781 -67.7469 -72.4130
quadrupole: 11.7344 -1.6892 -3.4010
quadrupole: -0.5988 2.6325 -2.0337 11.7344 -1.6892 -3.4010
hfenergy: -872.3946188 hartree
pointgroup: C01 [X(C5H7N1O3S1)]
dipole: 2.5292105 -1.1545795 0.8006433 debye
dipolederiv: 1.5980781 0.1610332 0.051173 -0.1790933 1.0693427 0.0173265 0.0846708 0.0393442 1.3172509 -0.7297735 -0.0672927 0.0294021 -0.0321836 -0.5329179 0.0174487 0.1701832 0.0655881 -0.5664767 -0.591229 -0.0119759 0.0227281 0.1010813 -0.4736092 0.0353812 -0.1701278 -0.0367145 -0.6550817 -0.6045266 -0.3563848 0.0329941 -0.2121837 -1.1138313 0.0021215 0.1878704 0.1926399 -0.3133839 -0.3940404 0.4329657 -0.0220859 -0.1977428 -1.2953446 0.0082101 -0.0211227 -0.0607009 -0.3186233 -0.418146 -0.1498784 0.0136224 -0.0174189 -0.1236052 -0.0024761 0.0876304 -0.0202896 -0.1241391 -0.6233337 -0.193064 0.0078231 -0.0444026 -0.2295058 -0.0333347 0.0836686 0.0077218 -0.4789789 0.6500836 0.1847517 0.0077121 0.5375602 0.7465072 -0.0217335 -0.053379 -0.0590226 0.0944692 0.8172247 -0.1213872 -0.1355463 0.0329748 1.5600023 -0.0526061 -0.3963329 -0.1845834 0.2218438 -0.1396823 0.1554653 0.0030473 -0.0088722 -0.051812 -0.0000715 0.0023081 -0.0384578 0.0821617 0.0577042 -0.0395391 -0.0329504 -0.02623 0.0873699 0.0180767 -0.0008867 0.0266338 0.0275961 0.0675923 -0.0189686 -0.0088385 0.0191368 0.044493 0.0000075 -0.0254565 0.00067 0.1098035 0.0470775 0.0566731 -0.0014689 0.051037 0.0375858 0.0097958 -0.0113034 0.0345918 0.2067349 0.2125087 0.0262178 0.0327838 -0.0010033 0.1586183 -0.0046219 0.0695328 0.0247957 0.2989361 -0.0013992 0.0362956 0.0724467 0.0065355 0.0820262 0.0603297 0.1031172 0.0209107 -0.0258756 0.0705085 -0.1128833 0.0071488 -0.031594 -0.0430825 0.0082936 0.0001885 0.0131592 0.1266428 -0.0186468 0.0179716 -0.0799916 0.0023988 0.077763 -0.0621475 -0.1105609 -0.0262864 -0.0028797 unknown
polarizability: 114.2197185|6.5384071|102.2080301|-3.2675703|-2.3806789|69.0197988 unknown
InChI: InChI=1S/C5H7NO3S/c1-4-2-10(8,9)3-5(7)6-4/h2,6H,3H2,1H3
charge 0 multiplicity 1
17 atoms
S  -1.587236 -0.252202 -0.077903
O  -2.805886 -0.66155 0.931721
O  -1.879988 0.044853 -1.657101
O  1.28378 2.55534 -0.1051
N  1.514751 0.250781 -0.060574
C  -0.639933 1.282403 0.663837
C  -0.209922 -1.488503 0.089395
C  1.094031 -1.09776 0.022261
C  0.767094 1.428701 0.116116
C  2.226025 -2.103301 0.031428
H  -0.637729 1.069965 1.745999
H  -1.250174 2.163595 0.423431
H  -0.55071 -2.522332 0.143482
H  2.490439 0.422256 -0.326189
H  2.823201 -2.024134 -0.897232
H  1.84094 -3.131376 0.096911
H  2.900916 -1.927137 0.889319
