program: Gaussian 09
title: 000290013
version: EM64L-G09RevD.01
frameworkgroup: C1[X(C8H17NO5S)]
method: RPBEPBE
basis: SDD
operation: Freq
keyword: #p
keyword: freq=noraman
keyword: PBEPBE/SDD
title: #p freq=noraman PBEPBE/SDD
converged: NO YES NO NO
title: Mulliken charges:
elementType: S O O O O O N C C C C C C C C H H H H H H H H H H H H H H H H H
charge: 0.927992 -0.260711 -0.258607 -0.548433 -0.570181 -0.247456 -0.604770 -0.620202 0.023601 -0.630005 -0.262536 -0.265430 0.245734 -0.660495 -0.661354 0.303760 0.272160 0.261886 0.280751 0.296125 0.225469 0.230532 0.230320 0.224434 0.215655 0.247265 0.218668 0.216282 0.234769 0.215978 0.378550 0.340248
chargesum: 0.00000
title: Mulliken charges with hydrogens summed into heavy atoms:
elementType: S O O O O O N C C C C C C C C
charge: 0.927992 -0.260711 -0.258607 -0.548433 -0.570181 -0.247456 0.114028 -0.044283 0.285487 -0.053129 0.193465 0.189324 0.245734 0.021094 0.005676
polarizability: 1.92558250e+02 1.80582934e+00 1.30882416e+02 2.43063269e+00 -4.02489068e+00 1.15916921e+02
1716.lowfreq: -4.1839 -0.0012 -0.0009 0.0010 4.2209 12.5854 25.9400 37.4062 46.3043
frequency: 25.8893 37.3512 46.2804 48.8955 58.1170 70.3922 83.9140 96.7392 117.7230 137.2004 192.1585 195.1456 215.3684 228.8860 235.3954 271.3671 278.1828 289.7629 307.6284 349.4791 361.7650 407.8789 446.7482 479.9253 516.8811 528.2563 552.4967 604.5137 622.5010 675.6621 752.5268 771.7106 778.7583 803.2054 804.5514 820.2692 845.0047 850.1809 890.0760 918.2649 939.9658 980.1547 1014.6393 1035.7613 1073.7893 1086.5605 1091.5710 1119.7199 1129.4737 1140.7993 1155.1236 1176.7252 1191.8944 1220.5404 1264.9515 1268.9445 1325.9969 1343.9419 1351.2214 1353.1150 1371.5650 1376.8502 1385.8657 1391.5891 1392.9692 1461.9632 1465.1239 1473.7680 1474.5655 1486.0162 1488.1558 1615.3706 1651.7876 2983.5039 2986.9573 2997.3559 3006.3600 3019.0846 3044.3707 3051.3307 3062.8370 3078.7108 3079.5749 3082.1946 3098.6094 3106.7257 3153.2277 3157.1487 3253.6210 3607.1635
redmass: 5.7508 4.5829 3.7536 3.4713 2.4185 3.3607 5.4593 3.0414 4.6872 5.1507 2.2714 4.3471 1.2129 3.3283 2.0179 6.1065 5.9780 2.8608 2.1846 3.4362 6.5490 3.2169 5.7226 2.4934 3.4982 3.4047 4.9094 2.5992 3.9269 1.7150 2.4870 4.0328 4.4971 1.1649 1.1418 1.2021 2.5481 3.9080 2.2423 3.6106 3.3686 2.2871 3.2808 3.5044 4.4877 2.0766 2.0551 1.4829 1.3964 1.2517 1.6343 1.7239 1.2610 1.2172 1.1268 1.1123 1.1365 1.2192 2.0715 1.5651 1.2660 1.0964 1.1607 1.1852 1.2240 1.0420 1.0439 1.0608 1.0539 1.0730 1.0740 1.5517 3.0266 1.0359 1.0363 1.0646 1.0591 1.0856 1.0576 1.0549 1.1037 1.1002 1.0991 1.0980 1.1025 1.1025 1.1072 1.1118 1.0668 1.0878
irintensity: 0.1867 0.5123 1.6159 1.9600 0.6194 1.9572 7.6285 3.1007 1.3321 2.8583 3.9654 12.5888 2.3051 1.3110 4.3053 11.8790 16.4203 14.9103 7.8722 1.6319 10.4728 5.5977 120.3384 18.4468 10.8574 19.3411 3.6271 29.9736 9.1683 90.1900 29.4449 2.2873 30.6254 8.6055 2.5870 145.9338 15.0159 4.8933 1.3296 70.7720 162.6408 14.1704 190.3868 5.7588 210.6111 17.2949 18.8864 3.4046 2.7560 0.8772 7.9239 19.2325 2.2080 1.0172 3.5796 2.4818 7.8196 4.2209 133.7579 30.7198 5.8916 10.6091 29.7871 10.2960 22.6029 13.8157 9.3748 1.1258 1.8871 10.4009 14.0797 151.5602 302.5892 20.2534 21.1473 23.3281 30.7347 5.3369 3.1529 3.8264 3.9077 2.0611 59.9167 39.1731 47.2808 44.6113 0.4456 1.3704 262.6307 93.0681
temp: 298.150 k
press: 1.00000 atm
elementType: 16 8 8 8 8 8 7 6 6 6 6 6 6 6 6 1 1 1 1 1 1 1 1 1 1 1 1 1 1 1 1 1
symmnumber: 1
zpe: 668630.6 jmol-1
zpe.correction: 0.254668 hartree
zpe.thermalcorrener: 0.273657 hartree
zpe.thermalcorrenthalpy: 0.274602 hartree
zpe.thermalcorrgfe: 0.205348 hartree
zpe.sumelectzpe: -1142.585445 hartree
zpe.sumelectthermal: -1142.566456 hartree
zpe.sumelectthermalent: -1142.565512 hartree
zpe.sumelectthermalfe: -1142.634765 hartree
dipole: 3.9817 2.6239 1.4745
dipole: 4.9913
quadrupole: -104.5930 -92.9858 -106.6006
quadrupole: 1.7058 -8.7549 1.7289
quadrupole: -3.1999 8.4073 -5.2075 1.7058 -8.7549 1.7289
hfenergy: -1142.8401132 hartree
pointgroup: C01 [X(C8H17N1O5S1)]
dipole: -1.5699258 1.0737515 -0.4884721 debye
polarizability: 190.0816864|-0.1067415|126.7554372|13.4239467|7.9585403|122.5204637 unknown
InChI: InChI=1S/C8H17NO5S/c1-3-13-8(14-4-2)6-15(11,12)5-7(9)10/h8H,3-6,9H2,1-2H3
charge 0 multiplicity 1
32 atoms
S  1.403293 -0.380359 0.26037
O  -1.455104 -1.046579 -0.882935
O  -2.684269 0.11434 0.876475
O  1.182758 -1.912367 0.787393
O  2.034956 -0.096871 -1.238913
O  4.828088 0.244229 2.385055
N  4.518591 -0.052726 0.081372
C  -0.307396 0.582609 0.397175
C  -1.416873 -0.470503 0.438363
C  2.599449 0.53712 1.525642
C  -1.804698 -2.492483 -0.931728
C  -3.327249 1.069463 -0.067512
C  4.090897 0.202926 1.355649
C  -3.280029 -2.76893 -0.616044
C  -3.135007 2.523206 0.383893
H  -0.313858 1.20301 -0.511568
H  -0.242251 1.165239 1.329503
H  -1.202325 -1.236365 1.208872
H  2.411922 1.608934 1.341608
H  2.250104 0.223315 2.519885
H  -1.553638 -2.78036 -1.965898
H  -1.12584 -3.031184 -0.241484
H  -2.943758 0.890815 -1.089274
H  -4.397061 0.797311 -0.048173
H  -3.479706 -3.853583 -0.704461
H  -3.538727 -2.449244 0.407789
H  -3.941862 -2.237075 -1.321994
H  -3.735742 3.200342 -0.252362
H  -3.464507 2.64923 1.429783
H  -2.07895 2.840163 0.311985
H  3.840943 -0.093975 -0.702974
H  5.505148 -0.269548 -0.06189
