program: Gaussian 09
title: 000290009
version: EM64L-G09RevD.01
frameworkgroup: C1[X(C17H15NO2S)]
method: RPBEPBE
basis: SDD
operation: Freq
keyword: #p
keyword: freq=noraman
keyword: PBEPBE/SDD
title: #p freq=noraman PBEPBE/SDD
converged: YES YES NO NO
title: Mulliken charges:
elementType: S O O N C C C C C C C C C C C C C C C C C H H H H H H H H H H H H H H H
charge: 0.900842 -0.552364 -0.556213 -0.259335 0.421783 0.421837 -0.627099 -0.627136 0.288573 0.288555 -0.632210 -0.375508 -0.387326 -0.387320 -0.375475 -0.225698 -0.218027 -0.218023 -0.225721 -0.229080 -0.229080 0.297350 0.297351 0.261211 0.245695 0.261206 0.244733 0.268421 0.268418 0.244734 0.233943 0.236384 0.236383 0.233944 0.237127 0.237127
chargesum: 0.00000
title: Mulliken charges with hydrogens summed into heavy atoms:
elementType: S O O N C C C C C C C C C C C C C C C C C
charge: 0.900842 -0.552364 -0.556213 -0.259335 0.421783 0.421837 -0.329749 -0.329785 0.288573 0.288555 0.135902 -0.130775 -0.118905 -0.118902 -0.130741 0.008245 0.018357 0.018359 0.008223 0.008047 0.008047
polarizability: 2.91177905e+02 5.07595125e-04 2.59918758e+02 -2.47608813e-03 1.54215387e+01 1.33553694e+02
1716.lowfreq: -8.4462 -3.6608 -0.0025 -0.0019 -0.0015 6.4111 32.7454 41.7596 51.4153
frequency: 32.7413 41.2860 51.3645 55.0780 70.0645 97.4828 104.8706 105.5095 156.6668 179.9610 201.7352 233.2142 248.0788 260.5770 287.1894 297.6712 324.0148 338.2160 376.9860 407.5369 407.7465 413.1295 451.5299 500.0139 529.7401 596.3157 609.0017 610.8947 613.9846 631.5059 683.4822 691.7510 703.6059 704.3899 720.6789 728.9509 749.2874 761.4925 782.7420 787.3050 798.0403 799.4361 855.9691 858.3265 909.8230 931.2584 932.9482 978.6927 980.2927 981.7933 989.0362 990.8045 1001.5985 1001.9674 1021.1748 1032.7435 1046.6059 1082.6984 1083.6077 1106.7005 1162.3446 1165.0137 1175.4358 1175.7834 1187.4754 1189.9851 1202.1501 1219.8610 1308.1329 1314.4634 1323.4440 1368.6674 1377.2918 1377.6165 1433.2229 1433.6526 1446.4145 1467.0010 1479.2067 1484.3560 1485.9474 1555.3502 1579.5770 1586.5831 1604.9783 1609.1618 1609.7636 3007.8163 3100.9888 3126.8159 3126.8662 3127.0965 3134.5975 3134.5988 3144.8813 3144.9663 3154.9352 3154.9552 3170.0350 3170.1130 3212.3362 3213.4730
redmass: 4.0658 2.4974 4.9990 7.1661 6.3155 4.0555 4.6170 1.3020 6.7427 3.9168 6.6763 7.9019 6.2052 4.6839 4.3889 4.4481 5.3734 5.2699 6.2947 3.4571 2.8492 6.3462 3.4501 3.7097 5.1155 6.4294 5.5352 7.0205 6.5859 4.9161 4.9184 5.0458 1.9392 2.1358 2.5597 3.4317 1.5488 1.4820 2.8886 2.1235 4.4019 4.0468 1.2435 1.2412 13.0561 1.4050 1.4046 4.2968 1.4372 1.5189 5.3288 5.4210 1.3223 1.3247 2.4157 1.9316 1.5495 1.5752 1.5870 1.3711 3.1417 1.2524 1.0556 1.0553 1.1218 1.1143 2.5830 1.8142 1.8945 1.3497 1.9299 4.3120 7.3778 7.4576 2.2437 2.2332 1.1751 1.0749 2.2392 2.2371 1.1070 8.5474 6.1901 6.2458 8.2506 6.1135 6.1882 1.0350 1.1005 1.0863 1.0931 1.0955 1.0873 1.0873 1.0922 1.0923 1.0966 1.0966 1.1016 1.1016 1.0936 1.0952
irintensity: 0.6272 0.0044 0.7318 1.0506 0.0610 3.2586 1.6119 0.0083 0.2360 3.7011 3.8130 0.9710 6.7405 5.8066 0.0432 14.6624 2.0614 21.0600 16.0625 5.9331 0.0233 16.0107 3.4749 14.0488 2.1831 0.4034 0.7461 1.3280 0.1016 3.6887 0.5944 2.8686 4.1078 50.0129 50.3822 37.8529 88.5184 9.1923 44.7387 1.5697 167.6780 0.4629 0.6837 0.7715 109.3073 0.2674 7.9877 11.2605 1.6236 0.4979 0.6065 0.0823 0.0689 0.0681 43.3930 10.8142 30.4884 4.4696 11.1088 1.0801 28.5196 0.9326 0.3161 0.0501 8.0956 0.4105 11.2704 3.8726 4.5599 0.3133 4.4751 126.0437 4.7111 0.4216 3.2581 12.2368 9.0745 18.4272 6.5215 20.5121 58.8215 21.8440 39.2205 0.2065 112.1920 0.0937 4.7621 37.9452 14.3029 0.4109 21.1171 0.5728 0.0274 0.0941 1.0554 23.4154 4.7928 42.1778 33.0230 11.7050 1.4293 20.0872
temp: 298.150 k
press: 1.00000 atm
elementType: 16 8 8 7 6 6 6 6 6 6 6 6 6 6 6 6 6 6 6 6 6 1 1 1 1 1 1 1 1 1 1 1 1 1 1 1
symmnumber: 1
zpe: 720024.3 jmol-1
zpe.correction: 0.274243 hartree
zpe.thermalcorrener: 0.293158 hartree
zpe.thermalcorrenthalpy: 0.294102 hartree
zpe.thermalcorrgfe: 0.225876 hartree
zpe.sumelectzpe: -1258.381452 hartree
zpe.sumelectthermal: -1258.362537 hartree
zpe.sumelectthermalent: -1258.361593 hartree
zpe.sumelectthermalfe: -1258.429819 hartree
dipole: 0.0001 -10.2551 0.7698
dipole: 10.2840
quadrupole: -98.1253 -152.9229 -138.6018
quadrupole: 0.0009 -0.0006 4.5961
quadrupole: 31.7580 -23.0396 -8.7184 0.0009 -0.0006 4.5961
hfenergy: -1258.6556947 hartree
pointgroup: C01 [X(C17H15N1O2S1)]
dipole: -0.0000214 3.9692658 -0.7843391 debye
polarizability: 291.1779048|-0.0002177|242.9985117|-0.0013737|-45.7127674|150.4739405 unknown
InChI: InChI=1S/C17H15NO2S/c1-18-16(14-8-4-2-5-9-14)12-21(19,20)13-17(18)15-10-6-3-7-11-15/h2-13H,1H3
charge 0 multiplicity 1
36 atoms
S  -0.000008 -2.979063 0.694377
O  -0.00002 -3.168167 2.324863
O  0.000007 -4.315828 -0.253582
N  -0.000028 0.16174 0.436925
C  1.239424 -0.494543 0.236308
C  -1.239456 -0.494563 0.236298
C  1.380379 -1.858148 0.201211
C  -1.380401 -1.858167 0.201182
C  2.442016 0.356352 -0.018612
C  -2.442045 0.356355 -0.01854
C  -0.000086 1.505456 1.088488
C  2.403258 1.402538 -0.979819
C  -3.658913 0.085549 0.660915
C  3.658825 0.085719 0.661018
C  -2.403179 1.402817 -0.979439
C  3.559171 2.163095 -1.25301
C  -4.814178 0.849975 0.387396
C  4.814112 0.850082 0.387418
C  -3.559068 2.163441 -1.252545
C  4.767937 1.890756 -0.568625
C  -4.767909 1.890901 -0.568369
H  2.294767 -2.377579 -0.088298
H  -2.294787 -2.377604 -0.088321
H  -0.89427 1.596743 1.723514
H  -0.000111 2.333365 0.360565
H  0.894059 1.59682 1.723557
H  1.476555 1.595419 -1.532605
H  -3.686966 -0.712481 1.411098
H  3.686807 -0.712108 1.411418
H  -1.476403 1.595878 -1.532042
H  3.522216 2.959085 -2.00465
H  -5.746235 0.635634 0.921096
H  5.746115 0.635889 0.921274
H  -3.522035 2.959644 -2.003955
H  5.664822 2.482798 -0.780866
H  -5.664774 2.482996 -0.780545
