program: Gaussian 09
title: 000290008
version: EM64L-G09RevD.01
frameworkgroup: C1[X(C6H9ClO2S)]
method: RPBEPBE
basis: SDD
operation: Freq
keyword: #p
keyword: freq=noraman
keyword: PBEPBE/SDD
title: #p freq=noraman PBEPBE/SDD
converged: NO NO NO NO
title: Mulliken charges:
elementType: Cl S O O C C C C C C H H H H H H H H H
charge: 0.040648 0.958701 -0.538382 -0.557513 -0.337421 -0.117135 -0.483814 -0.562462 -0.449339 -0.455149 0.310628 0.292530 0.298693 0.251939 0.334324 0.249326 0.283068 0.238942 0.242415
chargesum: 0.00000
title: Mulliken charges with hydrogens summed into heavy atoms:
elementType: Cl S O O C C C C C C
charge: 0.040648 0.958701 -0.538382 -0.557513 -0.026792 0.175395 0.066818 -0.228138 0.083055 0.026207
polarizability: 1.13462501e+02 -8.58393185e-01 9.96534494e+01 -4.83611566e+00 -1.15378096e+00 8.63607194e+01
1716.lowfreq: -12.6088 -0.0028 0.0022 0.0024 2.9046 12.4889 71.8810 132.4767 162.7230
frequency: 71.7404 132.4739 162.7206 184.9281 205.8569 247.9176 286.0565 325.7909 361.0941 396.5255 427.6004 471.2534 551.9108 682.3654 750.3873 778.5760 786.2235 808.5186 861.7657 887.9069 906.1719 927.9557 940.2721 960.3882 987.2250 1015.0753 1041.4800 1060.1040 1074.8919 1148.1542 1166.0234 1177.3515 1211.5535 1226.8638 1230.8991 1275.0999 1297.7165 1307.7477 1310.0643 1453.4824 1458.5244 1481.7276 3008.8219 3021.2733 3025.6102 3063.7611 3068.7146 3089.5495 3093.8941 3122.7697 3127.0642
redmass: 4.2126 16.3842 10.7140 4.8359 3.5880 4.0271 6.4874 4.4090 4.0803 2.4106 8.5000 5.8719 4.5694 5.6270 4.3400 2.5901 1.7952 14.1661 2.6741 2.7025 2.3333 6.1880 2.0534 1.9548 1.5741 1.0993 1.7893 1.4948 1.3966 1.5499 1.2366 1.2436 1.8807 1.3445 1.1448 1.3328 1.6582 1.5076 1.4695 1.0792 1.0773 1.0861 1.0613 1.0608 1.0625 1.0907 1.0997 1.1038 1.1051 1.0901 1.0919
irintensity: 1.4927 0.5655 4.0750 3.0154 0.4320 14.8073 15.2508 5.3601 3.3854 3.5381 12.8693 30.4749 2.2398 21.0374 18.8294 7.6261 17.6429 71.3507 9.2631 1.7575 10.5710 60.0933 21.4228 18.0145 3.7581 0.9809 2.6613 0.0081 3.7161 2.6375 3.7759 12.6562 3.0912 8.2989 1.8373 1.2039 6.7164 14.1529 10.7810 31.5811 10.6033 16.8982 16.7365 14.1594 25.9870 7.8994 3.6057 10.5326 8.7440 0.6877 1.3914
temp: 298.150 k
press: 1.00000 atm
elementType: 17 16 8 8 6 6 6 6 6 6 1 1 1 1 1 1 1 1 1
symmnumber: 1
zpe: 374801.1 jmol-1
zpe.correction: 0.142754 hartree
zpe.thermalcorrener: 0.152600 hartree
zpe.thermalcorrenthalpy: 0.153544 hartree
zpe.thermalcorrgfe: 0.107367 hartree
zpe.sumelectzpe: -1241.660815 hartree
zpe.sumelectthermal: -1241.650970 hartree
zpe.sumelectthermalent: -1241.650025 hartree
zpe.sumelectthermalfe: -1241.696203 hartree
dipole: 3.7071 -6.0951 0.8277
dipole: 7.1818
quadrupole: -73.7116 -82.0543 -73.8939
quadrupole: -0.3523 5.2304 1.6977
quadrupole: 2.8416 -5.5010 2.6594 -0.3523 5.2304 1.6977
hfenergy: -1241.8035696 hartree
pointgroup: C01 [X(C6H9Cl1O2S1)]
dipole: -2.4559822 1.3557717 0.3371566 debye
dipolederiv: -0.4640707 -0.303678 0.0137098 -0.2949225 -0.4099958 -0.00714 -0.0794278 -0.1051577 -0.0903561 1.0533348 -0.2405034 0.0521331 -0.0610879 1.1145671 0.0404391 -0.0110041 -0.0289915 1.0286525 -0.6625495 0.1653762 -0.0481413 0.0452044 -0.4884831 0.0108789 -0.1269092 0.1327786 -0.5405762 -0.5368432 -0.0125008 -0.0128587 0.0191178 -0.6988072 -0.0795459 0.0709881 -0.2124117 -0.6079454 0.2416917 0.0138761 -0.0583764 -0.0298072 -0.0455324 0.0358683 -0.0578291 0.0300858 0.0145981 -0.0257334 -0.093325 0.0262484 -0.0666452 -0.1398946 0.0262203 -0.0322731 0.0225115 -0.0305146 -0.112384 0.021297 0.044151 -0.0374335 -0.0177091 -0.013929 0.0135038 -0.0067688 -0.0733212 0.5390686 0.4471402 -0.0285876 0.3109301 0.5144955 0.0094 0.0738094 0.1585014 0.0105944 -0.1257124 -0.0353386 -0.0704214 -0.0238533 -0.0193998 -0.0188566 0.0364114 -0.0211441 -0.0507521 0.0221902 -0.0829846 -0.025761 0.0132825 0.0452748 0.03253 0.0230915 0.0079146 0.0634229 0.00406 -0.000327 0.0162311 0.0238123 0.0254399 0.0441209 0.0065626 0.0738412 0.0050525 0.0517867 0.067218 -0.0131054 0.0088139 -0.0947255 0.0245697 0.0056211 -0.0084286 0.0984301 0.0103609 -0.049667 -0.1127082 -0.0185993 0.0759989 -0.0079729 -0.0647061 -0.0068117 0.0571432 -0.0247068 0.0535054 0.1061918 0.0930964 0.0542584 -0.0598343 0.0833689 -0.0179073 0.0522373 0.0080928 -0.0290337 -0.0432484 -0.0499391 -0.0540549 -0.0052773 0.020052 0.0037458 -0.0142246 -0.1210047 -0.0459107 0.0857145 0.018423 0.081267 0.0216707 0.0385589 0.0476605 0.063511 0.1577083 0.0443655 0.0211558 -0.0149901 -0.0031199 -0.0351917 -0.0373333 -0.0657106 0.0440931 0.094091 -0.0042501 0.0584871 -0.0051181 0.0585736 -0.0303222 0.00117 0.0121966 -0.1144406 -0.1093804 0.0847407 -0.0108141 0.0697159 0.0018473 0.0123722 0.0363451 -0.015904 0.0843958 unknown
polarizability: 110.8428566|5.5904843|102.3918241|3.3474686|3.2258156|86.2419888 unknown
InChI: InChI=1S/C6H9ClO2S/c7-6-4-1-2-5(3-4)10(6,8)9/h4-6H,1-3H2
charge 0 multiplicity 1
19 atoms
Cl 2.018629 1.98917 -0.220773
S  0.831674 -0.965923 -0.052406
O  2.111218 -1.098874 0.947902
O  0.611854 -1.988694 -1.313264
C  -0.855973 -0.734945 0.998375
C  -0.733011 1.328997 -0.120219
C  -0.731895 0.756749 1.334366
C  0.602894 0.941711 -0.757868
C  -1.974573 -0.834402 -0.046164
C  -1.907461 0.541972 -0.799953
H  -0.801247 -1.47904 1.804588
H  -0.868187 2.422071 -0.162246
H  0.173678 1.013097 1.910114
H  -1.619237 1.102009 1.893812
H  0.633161 0.827233 -1.84977
H  -2.944535 -0.974499 0.464985
H  -1.823318 -1.693955 -0.72195
H  -1.742864 0.407429 -1.882851
H  -2.846408 1.108696 -0.677576
