program: Gaussian 09
title: 000290005
version: EM64L-G09RevD.01
frameworkgroup: C1[X(C13H18N4O6)]
method: RPBEPBE
basis: SDD
operation: Freq
keyword: #p
keyword: freq=noraman
keyword: PBEPBE/SDD
title: #p freq=noraman PBEPBE/SDD
converged: YES YES NO NO
title: Mulliken charges:
elementType: O O O O O O N N N N C C C C C C C C C C C C C H H H H H H H H H H H H H H H H H H
charge: -0.243266 -0.451864 -0.441239 -0.461411 -0.275602 -0.266748 -0.400783 -0.372756 -0.385826 -0.477158 -0.183256 -0.124412 -0.140016 0.017214 -0.392611 0.324350 0.289624 0.487997 -0.444079 -0.342871 -0.196763 -0.212274 -0.257880 0.261809 0.194037 0.250571 0.251570 0.214356 0.255926 0.315441 0.363427 0.366684 0.358006 0.316218 0.310493 0.294088 0.215010 0.304432 0.225354 0.225916 0.228292
chargesum: 0.00000
title: Mulliken charges with hydrogens summed into heavy atoms:
elementType: O O O O O O N N N N C C C C C C C C C C C C C
charge: -0.243266 -0.088437 -0.074555 -0.103405 -0.275602 -0.266748 -0.085342 -0.056538 -0.075334 -0.183070 0.078553 0.069626 0.110555 0.268784 0.077671 0.324350 0.289624 0.487997 -0.229070 -0.038439 0.028591 0.013642 -0.029588
polarizability: 2.74454715e+02 1.07255724e+01 1.74917984e+02 -2.34564841e+01 1.19381577e+01 1.33809183e+02
1716.lowfreq: -16.0691 -6.9090 -1.5568 -0.0010 -0.0005 -0.0004 10.7476 14.2732 20.1945
frequency: 6.5096 14.1366 19.9290 39.0786 55.7968 59.1649 70.9247 81.0714 110.4159 121.3064 136.6622 177.7922 209.5900 225.3425 228.4419 242.5717 253.9949 257.9166 279.5093 333.7929 344.6181 349.7948 380.3433 397.0127 407.2467 408.8291 423.9494 447.9200 470.8177 475.9970 503.3524 513.9402 517.0588 558.4610 587.4041 592.5126 604.7448 614.1274 641.2670 692.8668 695.9526 718.5918 735.2595 752.3854 760.9364 766.3997 813.2407 837.2334 839.6514 859.8722 888.2510 913.5640 918.7163 970.3816 974.6863 978.7686 986.0079 993.4598 997.6666 1015.9350 1027.8680 1037.3253 1041.2140 1066.4877 1089.7969 1124.5259 1148.0412 1172.1037 1174.9162 1179.7653 1189.1557 1190.9171 1227.1966 1241.8535 1244.6278 1255.3547 1260.0876 1278.1014 1305.1425 1310.7845 1322.3169 1337.7316 1350.1150 1353.7992 1362.2507 1379.9908 1384.4592 1395.9652 1430.1384 1447.5628 1450.8626 1476.9352 1486.7505 1497.0596 1522.7321 1603.0697 1616.8367 1651.8005 1667.6515 2917.9059 2971.9137 3005.8626 3043.4084 3067.6119 3093.9132 3106.9153 3131.8332 3144.0239 3165.3021 3193.9241 3470.7835 3503.3648 3518.1376 3519.0385 3527.2439 3538.8457 3560.5544
redmass: 5.9136 6.2056 4.3624 6.9811 6.1651 6.3621 5.9845 6.4944 6.0912 4.6735 4.4812 4.7006 1.8760 4.1513 4.1194 2.0397 5.2595 4.5030 3.7171 5.3680 4.5372 3.5467 5.3843 2.6200 3.0963 3.5490 3.6207 1.1797 1.1958 2.5136 1.9930 2.9513 2.3167 4.7945 1.2901 1.2942 3.2248 6.0059 4.6158 9.0667 2.0073 8.0992 5.4107 5.2726 5.5290 1.7655 4.0132 4.4825 1.3356 4.9889 2.5358 1.4320 3.7569 1.3522 5.1920 5.9197 5.8726 3.2482 1.3093 3.3902 2.1459 4.1773 3.1417 2.4497 1.5596 2.4695 3.4892 1.0669 2.0409 1.3186 1.1171 1.3310 1.4490 2.3054 1.5692 1.1651 1.9702 1.3565 3.6213 1.4450 1.4259 1.2336 1.3037 1.2345 1.1772 1.2846 5.8236 1.7224 2.2003 1.1176 1.4699 1.4190 2.3362 1.9012 2.1653 5.1096 5.9445 6.3653 5.1184 1.0818 1.0666 1.0853 1.0852 1.0876 1.0977 1.0887 1.0866 1.0932 1.0998 1.0951 1.0646 1.0653 1.0652 1.0778 1.0768 1.0781 1.0776
irintensity: 0.0483 0.1514 1.2576 0.5836 2.4108 3.6141 5.5538 12.8809 3.4141 2.1926 9.7878 1.6918 6.7189 10.5995 10.5035 1.9901 15.4876 29.3112 19.5507 2.6374 4.1659 3.6067 50.4146 0.4740 3.4720 13.4017 19.8182 51.4808 92.4737 11.8455 32.2801 91.9450 101.7821 10.3880 181.8587 110.7438 65.7004 5.6989 14.1791 4.0299 50.3762 4.3478 20.4262 6.9673 21.0231 86.7718 45.7964 3.6817 0.2836 143.6251 27.7958 14.5687 143.0085 0.1739 21.2130 10.8697 6.7151 40.8394 3.2248 188.9298 2.1948 60.4604 18.3313 29.4064 16.9279 8.5717 77.2606 2.1436 106.7086 192.7721 12.2077 40.6306 87.4984 295.5980 38.1894 20.0867 37.8836 2.9489 8.8958 3.9046 55.8833 1.6715 7.6293 15.5858 49.5532 26.2468 62.0113 5.0608 46.8707 29.4326 193.4298 112.9408 103.8479 586.9824 326.4742 48.9850 73.2638 260.9853 53.0530 46.6204 37.0766 12.5128 16.6237 36.3623 17.7474 17.4445 0.4864 31.4021 25.1318 7.4538 31.5605 12.9268 18.6020 11.3722 17.0013 36.2845 27.7595
temp: 298.150 k
press: 1.00000 atm
elementType: 8 8 8 8 8 8 7 7 7 7 6 6 6 6 6 6 6 6 6 6 6 6 6 1 1 1 1 1 1 1 1 1 1 1 1 1 1 1 1 1 1
symmnumber: 1
zpe: 837727.2 jmol-1
zpe.correction: 0.319073 hartree
zpe.thermalcorrener: 0.341788 hartree
zpe.thermalcorrenthalpy: 0.342732 hartree
zpe.thermalcorrgfe: 0.262734 hartree
zpe.sumelectzpe: -1174.774157 hartree
zpe.sumelectthermal: -1174.751442 hartree
zpe.sumelectthermalent: -1174.750498 hartree
zpe.sumelectthermalfe: -1174.830496 hartree
dipole: -0.4893 -3.2873 1.1135
dipole: 3.5051
quadrupole: -124.0192 -131.7866 -128.1998
quadrupole: -5.7264 -5.4746 0.9193
quadrupole: 3.9827 -3.7847 -0.1979 -5.7264 -5.4746 0.9193
hfenergy: -1175.09323 hartree
pointgroup: C01 [X(C13H18N4O6)]
dipole: -0.1829576 1.1758832 -0.6967531 debye
polarizability: 273.5256188|-5.4996962|177.9493959|27.7340267|2.6759159|131.7068669 unknown
InChI: InChI=1S/C13H18N4O6/c18-8-6-23-11(10(20)9(8)19)15-13(22)17-16-12(21)14-7-4-2-1-3-5-7/h1-5,8-11,14-20H,6H2
charge 0 multiplicity 1
41 atoms
O  -3.917045 1.450691 -0.327385
O  -6.030926 -2.070717 0.473959
O  -3.181291 -2.205301 -0.124681
O  -6.672121 0.447988 -0.561375
O  -0.550447 1.455016 0.469293
O  2.158284 -0.888089 -1.035276
N  -1.947188 0.26075 -0.995129
N  0.190418 0.948161 -1.694804
N  1.498027 1.327592 -1.406797
N  3.549561 0.907446 -0.357999
C  -5.12526 -0.946092 0.740065
C  -3.963292 -0.984806 -0.282004
C  -5.886949 0.399251 0.693455
C  -3.050261 0.239372 -0.086852
C  -4.901178 1.577186 0.767536
C  -0.75603 0.906084 -0.647067
C  2.398131 0.343785 -0.909464
C  4.716991 0.232407 0.102103
C  5.779725 1.037418 0.595188
C  4.852644 -1.181374 0.088646
C  6.965261 0.439367 1.067412
C  6.048372 -1.762953 0.562965
C  7.109183 -0.967591 1.053315
H  -4.717281 -1.129504 1.751064
H  -4.401571 -0.935613 -1.30712
H  -6.636372 0.440216 1.50178
H  -2.664836 0.302427 0.950807
H  -4.386684 1.606453 1.75079
H  -5.41711 2.535048 0.59425
H  -2.001544 -0.309165 -1.839843
H  -6.66967 -1.749062 -0.221155
H  -3.830093 -2.952332 -0.025855
H  -6.073205 0.814003 -1.266574
H  0.064168 0.41765 -2.558593
H  1.622975 2.321832 -1.203474
H  3.568736 1.923949 -0.249144
H  5.677819 2.130885 0.609213
H  4.029991 -1.79653 -0.280147
H  7.775106 1.073133 1.44547
H  6.145957 -2.854433 0.55075
H  8.029706 -1.433548 1.420277
