program: Gaussian 09
title: 000290001
version: EM64L-G09RevD.01
frameworkgroup: C1[X(C16H12Cl2O2S)]
method: RPBEPBE
basis: SDD
operation: Freq
keyword: #p
keyword: freq=noraman
keyword: PBEPBE/SDD
title: #p freq=noraman PBEPBE/SDD
converged: YES YES NO NO
title: Mulliken charges:
elementType: Cl Cl S O O C C C C C C C C C C C C C C C C H H H H H H H H H H H H
charge: -0.055227 -0.058908 0.221017 -0.238530 -0.133497 -0.269277 0.607097 -0.729311 -0.406707 0.136984 -0.350152 -0.409386 -0.267906 -0.118985 -0.228825 0.361318 -0.314500 -0.358013 -0.206420 -0.182536 -0.118059 0.255560 0.317010 0.262735 0.254997 0.243642 0.239941 0.253090 0.260728 0.250607 0.266993 0.254873 0.259646
chargesum: 0.00000
title: Mulliken charges with hydrogens summed into heavy atoms:
elementType: Cl Cl S O O C C C C C C C C C C C C C C C C
charge: -0.055227 -0.058908 0.221017 -0.238530 -0.133497 -0.013717 0.607097 -0.149566 -0.406707 0.136984 -0.095155 0.074198 -0.014817 -0.118985 0.031903 0.361318 -0.063893 -0.091020 0.048454 0.077110 -0.118059
polarizability: 2.91736907e+02 -1.94573399e+01 2.04392057e+02 -5.38462975e+00 3.27716769e+00 1.44830966e+02
1716.lowfreq: -6.3134 -3.5073 -0.0016 -0.0015 -0.0004 1.0715 10.5559 20.5348 31.2085
frequency: 10.4662 20.3268 31.1783 39.2002 71.7550 82.4172 115.8870 126.3600 155.5243 161.5553 166.8392 197.6636 235.3683 264.3204 286.3056 301.3024 315.2798 315.8909 376.7278 400.7270 415.6106 424.8657 454.3664 472.0328 497.9821 517.6299 529.7499 562.9471 587.9966 623.9474 627.3834 665.3895 696.4452 697.9764 725.6227 733.4243 791.0956 801.4824 814.8853 826.8255 831.7359 871.8023 902.1777 926.4471 940.6993 947.1929 956.6776 964.3219 991.7761 997.6908 1030.9911 1041.2930 1071.8550 1074.1490 1077.2959 1109.7609 1130.4207 1147.0791 1175.6177 1189.8189 1203.5841 1220.0484 1246.1400 1258.2053 1269.3949 1290.2908 1307.4571 1349.7374 1364.3998 1376.7652 1395.1278 1404.5129 1437.7924 1442.8054 1454.2110 1475.4008 1573.3409 1585.2495 1587.5961 1605.7031 1662.8040 2913.4765 2954.7382 2961.5198 3047.2342 3132.4405 3153.3835 3154.3165 3155.9377 3163.5015 3174.9484 3177.2320 3182.8157
redmass: 13.3527 4.4882 7.5045 7.4834 5.8944 10.6711 9.3908 9.4803 3.4032 4.9158 4.1787 7.2283 6.1874 6.5371 7.8800 6.0723 13.0318 7.5271 10.7762 4.9133 3.0313 3.2822 4.7175 5.4326 2.7281 4.1878 5.9517 3.7930 7.5311 7.1893 4.8255 4.9778 5.8494 3.5649 5.2585 4.2283 4.9841 1.3380 1.3505 1.5091 4.5661 1.4236 3.6963 1.3666 1.8854 1.3797 1.3625 2.5926 3.9989 3.5344 4.6302 3.5653 2.5325 2.4590 2.0635 1.3161 1.6805 1.3267 1.1762 2.2226 1.0867 4.0746 1.2757 1.2750 1.3937 1.2608 1.3682 1.7641 7.1537 4.1365 3.8081 3.6899 1.2171 1.9187 1.1866 2.2346 7.6899 7.2971 7.5041 6.7536 9.2333 1.0554 1.0825 1.1010 1.0573 1.1089 1.0894 1.0879 1.0925 1.0887 1.0966 1.0967 1.0979
irintensity: 0.0486 0.1009 0.1173 0.5785 1.4644 2.2929 1.5625 0.3172 3.3228 5.6938 6.8504 0.3176 0.1026 3.0721 0.1035 0.9756 1.7961 1.0883 10.3625 8.2544 0.2168 8.1283 2.8793 0.3520 22.2491 6.0993 15.1568 5.4232 6.3275 0.9720 10.9849 36.3970 1.9746 0.2135 5.6837 11.8866 3.8014 21.1842 40.7172 71.4294 13.8617 14.2275 11.9742 0.0289 1.3560 0.2850 0.8949 20.0646 25.5184 120.8285 76.0425 20.6618 49.3530 31.5430 36.3462 14.0502 12.0411 18.0140 40.8951 6.8134 1.5532 311.6654 12.5540 4.1412 7.8716 0.2660 27.0782 29.2077 6.9706 1.5842 22.0987 2.3773 113.1153 71.8448 35.9479 191.1520 4.4796 15.5997 4.7410 23.7296 86.0061 80.4254 21.7816 22.6874 11.8399 7.1916 3.7613 13.3326 1.5785 1.6515 5.7775 3.1794 0.7497
temp: 298.150 k
press: 1.00000 atm
elementType: 17 17 16 8 8 6 6 6 6 6 6 6 6 6 6 6 6 6 6 6 6 1 1 1 1 1 1 1 1 1 1 1 1
symmnumber: 1
zpe: 617295.0 jmol-1
zpe.correction: 0.235115 hartree
zpe.thermalcorrener: 0.254297 hartree
zpe.thermalcorrenthalpy: 0.255241 hartree
zpe.thermalcorrgfe: 0.183255 hartree
zpe.sumelectzpe: -2084.022851 hartree
zpe.sumelectthermal: -2084.003669 hartree
zpe.sumelectthermalent: -2084.002725 hartree
zpe.sumelectthermalfe: -2084.074711 hartree
dipole: 1.4489 -1.5222 -3.0414
dipole: 3.6968
quadrupole: -152.9995 -147.1106 -144.9500
quadrupole: 2.6931 -4.8511 4.0676
quadrupole: -4.6461 1.2428 3.4034 2.6931 -4.8511 4.0676
hfenergy: -2084.2579659 hartree
pointgroup: C01 [X(C16H12Cl2O2S1)]
dipole: -0.4728563 -0.7024605 1.1825169 debye
polarizability: 283.0859293|32.7030468|213.2101875|-3.1794605|-2.8413186|144.6638136 unknown
InChI: InChI=1S/C16H12Cl2O2S/c17-10-1-4-12(5-2-10)20-8-15(19)14-9-21-16-6-3-11(18)7-13(14)16/h1-7,14H,8-9H2
charge 0 multiplicity 1
33 atoms
Cl -3.469275 3.464192 -0.123342
Cl 7.188168 1.989632 0.924713
S  -3.96382 -2.894075 0.693022
O  1.869356 -0.285787 -0.776988
O  -0.372802 -1.515688 -1.746968
C  -1.53826 -1.571816 0.410824
C  -2.664989 -0.533127 0.299195
C  -2.166031 -2.946985 0.070452
C  -3.962982 -1.081315 0.471301
C  -0.344991 -1.268754 -0.522745
C  -2.508735 0.85568 0.118537
C  0.863483 -0.658538 0.193082
C  -5.107014 -0.259279 0.471758
C  -3.662336 1.667391 0.119441
C  -4.954375 1.136745 0.297033
C  3.081161 0.240872 -0.28888
C  3.375925 0.451455 1.080382
C  4.033099 0.563866 -1.286645
C  4.633264 0.986541 1.448051
C  5.283392 1.096434 -0.920039
C  5.567921 1.300775 0.447204
H  -1.184162 -1.576254 1.464235
H  -2.184484 -3.098322 -1.020421
H  -1.660004 -3.786055 0.570149
H  -1.524537 1.308786 -0.035736
H  0.525121 0.216427 0.792957
H  1.250558 -1.416935 0.912175
H  -6.107344 -0.684855 0.595621
H  -5.828438 1.793844 0.288332
H  2.654994 0.21349 1.867905
H  3.777218 0.390665 -2.335661
H  4.87301 1.153827 2.501901
H  6.024011 1.347565 -1.684344
