program: Gaussian 09
title: 000289999
version: EM64L-G09RevD.01
frameworkgroup: C1[X(C15H12N2O)]
method: RPBEPBE
basis: SDD
operation: Freq
keyword: #p
keyword: freq=noraman
keyword: PBEPBE/SDD
title: #p freq=noraman PBEPBE/SDD
converged: YES YES NO NO
title: Mulliken charges:
elementType: O N N C C C C C C C C C C C C C C C H H H H H H H H H H H H
charge: -0.248261 -0.228443 0.003624 0.202244 0.285353 0.307726 -0.497872 -0.344028 -0.665896 0.013871 -0.413855 -0.220362 0.329969 -0.243951 -0.327338 -0.290902 -0.345201 -0.347753 0.291306 0.245909 0.232977 0.304543 0.231802 0.245187 0.227199 0.227931 0.268443 0.266243 0.244122 0.245413
chargesum: 0.00000
title: Mulliken charges with hydrogens summed into heavy atoms:
elementType: O N N C C C C C C C C C C C C C C C
charge: -0.248261 -0.228443 0.003624 0.202244 0.285353 0.307726 -0.206566 -0.098119 0.103426 0.013871 -0.168668 0.006836 0.329969 -0.016020 -0.058896 -0.024658 -0.101079 -0.102340
polarizability: 3.00519113e+02 -1.62553927e+01 1.82265648e+02 1.02317605e+01 -4.10685773e+00 9.34803465e+01
1716.lowfreq: -8.7719 -0.0006 0.0002 0.0004 1.4647 4.3292 39.0385 54.0446 65.0718
frequency: 39.0264 54.0163 65.0689 100.6168 118.0755 137.8497 171.0077 202.7885 249.2333 277.7803 287.6217 299.1572 358.6746 371.9566 419.8985 437.3651 495.0711 540.3627 566.6797 572.1964 580.4479 621.4866 659.4543 670.3016 721.3288 728.7879 747.8871 757.0046 764.6062 790.9510 833.3508 844.7014 861.5511 880.9668 895.3342 934.6945 944.0866 958.4703 975.8422 979.9700 981.2453 1008.5574 1061.7551 1084.3511 1096.8503 1125.3653 1130.1815 1139.0018 1165.1972 1177.4830 1216.6326 1242.8060 1261.0371 1296.8166 1322.4539 1327.2460 1338.3353 1380.4005 1398.5189 1414.4354 1423.4898 1456.8176 1460.2900 1471.0157 1484.9137 1497.1698 1504.7427 1527.5572 1555.7806 1577.1382 1578.6648 1626.2168 2983.6135 3066.1755 3131.0020 3133.5846 3134.7515 3139.5176 3140.7254 3155.0280 3166.0788 3168.1897 3171.7254 3227.1228
redmass: 4.9020 3.9151 5.6283 3.9478 1.1872 3.2352 6.3599 5.6113 4.9803 4.6763 4.4092 3.7687 8.6646 2.5953 5.7343 3.1350 4.4896 5.5679 3.9467 4.3446 6.1604 4.7130 6.9455 6.7753 4.0779 4.9902 1.5697 2.0870 3.2875 4.6757 1.3602 1.7733 1.5821 4.6068 1.2836 3.7710 1.3793 6.2100 1.3977 1.3150 1.4830 2.1550 2.1913 1.5882 2.4474 1.3252 1.7265 2.1257 1.2047 1.3101 1.3051 2.0974 3.5244 6.5273 1.8267 1.8884 2.7538 3.7395 1.8579 4.6867 1.7342 2.6189 2.1782 1.7069 1.6714 1.1546 2.9697 6.8192 7.6891 6.2643 5.8641 7.2999 1.0369 1.1011 1.0852 1.0887 1.0985 1.0901 1.0895 1.0954 1.0952 1.1002 1.0971 1.0974
irintensity: 0.9330 0.3870 0.1763 2.8141 0.3321 2.1537 6.8832 4.3178 0.4062 1.2813 0.7470 6.4039 7.0803 0.2027 3.0467 9.3381 12.0247 3.9888 0.6651 6.4544 21.4146 2.0262 2.5998 29.2124 20.7301 10.4517 24.6210 76.1866 12.7571 0.8830 21.5555 36.2722 5.9509 2.2902 3.6654 59.0703 3.4326 3.5230 0.1777 0.0600 3.2770 3.4025 11.0010 2.0720 4.8409 6.8681 25.5603 3.4148 37.7081 20.0556 9.8010 86.2055 101.7030 0.5428 1.8718 10.7088 4.1888 49.9742 12.4848 58.3445 59.4837 71.9797 26.3586 40.5158 6.9925 34.7443 22.9458 268.6594 102.2236 0.7439 7.1359 26.1070 61.6825 24.0315 0.0544 17.1403 4.0109 16.7336 4.8480 24.7555 12.6552 33.8487 4.8904 1.0149
temp: 298.150 k
press: 1.00000 atm
elementType: 8 7 7 6 6 6 6 6 6 6 6 6 6 6 6 6 6 6 1 1 1 1 1 1 1 1 1 1 1 1
symmnumber: 1
zpe: 609291.9 jmol-1
zpe.correction: 0.232067 hartree
zpe.thermalcorrener: 0.246566 hartree
zpe.thermalcorrenthalpy: 0.247510 hartree
zpe.thermalcorrgfe: 0.189713 hartree
zpe.sumelectzpe: -762.285424 hartree
zpe.sumelectthermal: -762.270925 hartree
zpe.sumelectthermalent: -762.269981 hartree
zpe.sumelectthermalfe: -762.327779 hartree
dipole: 3.7903 -0.2344 0.5489
dipole: 3.8370
quadrupole: -107.1807 -101.0143 -105.0715
quadrupole: -0.6902 4.5054 1.1976
quadrupole: -2.7585 3.4079 -0.6493 -0.6902 4.5054 1.1976
hfenergy: -762.5174913 hartree
pointgroup: C01 [X(C15H12N2O1)]
dipole: 1.4936501 -0.0519295 0.212648 debye
polarizability: 301.464771|-12.7800757|181.4989453|9.6796225|-0.5428383|93.3013919 unknown
InChI: InChI=1S/C15H12N2O/c1-17-13-5-3-2-4-12(13)10-14(17)15(18)11-6-8-16-9-7-11/h2-10H,1H3
charge 0 multiplicity 1
30 atoms
O  -1.40094 2.359629 -0.190594
N  1.339621 1.290936 0.228013
N  -4.728355 -1.435525 0.190399
C  2.445835 0.449766 0.1028
C  0.169138 0.531543 -0.022173
C  1.980843 -0.867054 -0.265255
C  0.551745 -0.794379 -0.332875
C  3.820714 0.734336 0.285149
C  1.436042 2.69604 0.657257
C  -1.185283 1.104813 -0.068301
C  2.927513 -1.909591 -0.474269
C  4.73138 -0.317462 0.076099
C  -2.369946 0.171806 0.009706
C  4.291747 -1.626093 -0.301509
C  -2.394435 -1.003658 0.803935
C  -3.558968 0.534551 -0.674324
C  -3.585916 -1.762683 0.86411
C  -4.695172 -0.293325 -0.564645
H  -0.12941 -1.590358 -0.626164
H  4.170103 1.73033 0.574631
H  2.167084 3.229138 0.023624
H  0.454379 3.173415 0.538782
H  1.762941 2.758969 1.711877
H  2.595865 -2.913435 -0.760801
H  5.803788 -0.131904 0.203127
H  5.03713 -2.413676 -0.455505
H  -1.521169 -1.308248 1.388019
H  -3.581351 1.453025 -1.268338
H  -3.639003 -2.669347 1.477426
H  -5.623422 -0.045858 -1.091198
