program: Gaussian 09
title: 000289998
version: EM64L-G09RevD.01
frameworkgroup: C1[X(C14H13NO3)]
method: RPBEPBE
basis: SDD
operation: Freq
keyword: #p
keyword: freq=noraman
keyword: PBEPBE/SDD
title: #p freq=noraman PBEPBE/SDD
converged: YES YES NO NO
title: Mulliken charges:
elementType: O O O N C C C C C C C C C C C C C C H H H H H H H H H H H H H
charge: -0.237653 -0.263221 -0.198166 -0.142529 -0.191297 -0.440948 0.456758 -0.558175 -0.412466 -0.517498 0.140505 0.164349 0.280440 -0.350134 -0.374001 -0.230090 -0.220345 -0.225106 0.267618 0.284256 0.243997 0.240982 0.257717 0.237832 0.276760 0.286249 0.254290 0.265259 0.234476 0.234541 0.235601
chargesum: 0.00000
title: Mulliken charges with hydrogens summed into heavy atoms:
elementType: O O O N C C C C C C C C C C C C C C
charge: -0.237653 -0.263221 -0.198166 -0.142529 0.076320 0.087305 0.456758 -0.059476 0.102126 -0.231249 0.140505 0.164349 0.280440 -0.095844 -0.108742 0.004386 0.014196 0.010495
polarizability: 2.27409025e+02 6.97019757e+00 1.54626656e+02 1.69075668e+01 -1.22855673e+01 1.17149061e+02
1716.lowfreq: -9.3183 -3.5934 -0.0004 -0.0003 0.0006 9.1366 30.3512 47.9211 57.0078
frequency: 29.7811 47.9043 56.9897 80.0407 99.2278 133.9757 187.4928 199.3213 262.5153 281.0136 322.7883 358.0575 370.8324 399.2411 407.0956 417.3966 463.7786 494.0920 548.0480 566.5938 614.0886 628.3084 665.7471 678.0018 688.5164 701.0810 709.1649 722.5069 789.6680 797.8284 801.9479 861.5978 864.7667 869.4195 888.6036 939.4238 959.7503 984.6826 986.1972 989.9311 991.1118 1003.3293 1022.2185 1045.5383 1055.9128 1084.5009 1086.1838 1127.7164 1142.9964 1162.2001 1168.4021 1175.1695 1188.2222 1223.4095 1243.0001 1260.4930 1285.6301 1292.5262 1308.1768 1316.4347 1351.2582 1355.1044 1381.7262 1394.3388 1433.4597 1447.6852 1460.3736 1466.9964 1480.5434 1552.9205 1590.6252 1609.6891 1648.5080 1707.9327 2997.8399 3005.4829 3005.9488 3018.8486 3073.8462 3108.0948 3126.4004 3129.3615 3136.4756 3147.7170 3158.4999 3170.7380 3215.6754
redmass: 4.9210 7.2268 4.2762 5.4485 7.0537 4.5287 4.8233 4.5462 3.7304 4.1942 3.7844 4.7381 3.0268 3.9401 2.8930 3.4630 4.2684 4.7796 4.5141 4.5337 6.3982 6.0694 4.0218 6.6184 3.5326 4.0274 1.9287 2.9564 2.3241 6.8135 2.6401 1.4044 2.3451 1.4860 2.5917 1.4296 3.7491 1.7251 2.5677 5.7609 1.8104 1.3327 2.5524 2.1444 3.8691 1.6610 3.4775 1.8738 2.0078 1.5422 1.5254 1.0547 1.1161 2.0632 1.3583 2.1826 1.3472 1.3269 1.5420 1.3420 1.7401 1.3353 8.5742 2.2809 2.2263 1.1247 1.1003 1.1006 2.2895 8.2674 6.3269 6.0487 8.0766 12.3263 1.0644 1.0638 1.0720 1.0792 1.1003 1.0990 1.0941 1.0888 1.0882 1.0924 1.0963 1.1014 1.0989
irintensity: 0.4978 6.0503 2.4145 3.0536 2.1771 5.2364 1.4674 1.5067 2.5515 1.8340 1.0194 0.2034 9.7198 7.5100 0.5208 4.5522 1.5118 6.4497 6.0149 10.9712 0.1409 15.3596 7.5878 8.1060 4.6809 5.1674 87.5187 18.1498 30.9721 85.9976 11.6489 0.5197 8.1068 25.4635 45.0527 3.7449 5.6547 5.7178 21.5946 0.8784 17.4437 0.2422 52.8421 50.9297 5.2991 14.2460 56.6284 26.2503 3.5472 13.8078 0.3538 0.1055 8.8126 32.4694 7.8821 125.9280 48.8210 75.5456 16.5800 1.7787 7.0021 6.2009 0.7282 216.6743 13.1808 32.3292 15.5165 4.5318 12.2068 209.5897 17.4384 7.0073 62.9741 509.4229 15.0209 19.4833 9.3894 33.6249 27.8712 1.8766 6.7950 0.4886 2.0078 16.8845 19.5506 18.7127 0.7619
temp: 298.150 k
press: 1.00000 atm
elementType: 8 8 8 7 6 6 6 6 6 6 6 6 6 6 6 6 6 6 1 1 1 1 1 1 1 1 1 1 1 1 1
symmnumber: 1
zpe: 635376.6 jmol-1
zpe.correction: 0.242002 hartree
zpe.thermalcorrener: 0.256629 hartree
zpe.thermalcorrenthalpy: 0.257573 hartree
zpe.thermalcorrgfe: 0.198930 hartree
zpe.sumelectzpe: -820.429087 hartree
zpe.sumelectthermal: -820.414461 hartree
zpe.sumelectthermalent: -820.413516 hartree
zpe.sumelectthermalfe: -820.472160 hartree
dipole: -2.4740 1.9580 0.9377
dipole: 3.2914
quadrupole: -113.9713 -117.8095 -97.4326
quadrupole: 32.7301 3.0529 -0.9557
quadrupole: -4.2335 -8.0717 12.3052 32.7301 3.0529 -0.9557
hfenergy: -820.6710893 hartree
pointgroup: C01 [X(C14H13N1O3)]
dipole: 1.0121132 0.798939 -0.1192523 debye
polarizability: 223.7542329|-14.4237513|148.483339|23.0293561|17.5114923|126.9471701 unknown
InChI: InChI=1S/C14H13NO3/c16-13-8-11-6-7-15(9-12(11)18-13)14(17)10-4-2-1-3-5-10/h1-5,8,12H,6-7,9H2
charge 0 multiplicity 1
31 atoms
O  -2.561227 -1.651075 -0.176147
O  1.43565 2.303201 0.989367
O  -4.825005 -1.962542 -0.734724
N  0.014914 1.087985 -0.402347
C  -1.749044 -0.501184 0.257908
C  -0.589458 -0.216805 -0.745393
C  -2.699872 0.681668 0.302508
C  -2.113945 2.041319 0.543655
C  -0.918363 2.23645 -0.448819
C  -3.94416 0.262717 -0.062507
C  1.215469 1.246554 0.315104
C  -3.925938 -1.191819 -0.365182
C  2.258115 0.164243 0.220448
C  2.57863 -0.480286 -1.003586
C  3.021709 -0.125824 1.380183
C  3.633606 -1.416905 -1.05844
C  4.063384 -1.075433 1.327765
C  4.370251 -1.725671 0.108764
H  -1.327119 -0.737933 1.253141
H  0.156845 -1.020047 -0.689641
H  -1.010222 -0.190355 -1.76841
H  -2.86079 2.840928 0.398919
H  -1.71559 2.126275 1.572884
H  -1.306321 2.329829 -1.480818
H  -0.353495 3.142004 -0.180698
H  -4.852115 0.856255 -0.165019
H  2.030941 -0.223073 -1.917603
H  2.796897 0.412585 2.306748
H  3.883871 -1.899216 -2.009488
H  4.641131 -1.301593 2.230399
H  5.18445 -2.457451 0.066231
