program: Gaussian 09
title: 000289996
version: EM64L-G09RevD.01
frameworkgroup: C1[X(C25H26N2O4)]
method: RPBEPBE
basis: SDD
operation: Freq
keyword: #p
keyword: freq=noraman
keyword: PBEPBE/SDD
title: #p freq=noraman PBEPBE/SDD
converged: YES YES NO NO
title: Mulliken charges:
elementType: O O O O N N C C C C C C C C C C C C C C C C C C C C C C C C C H H H H H H H H H H H H H H H H H H H H H H H H H H
charge: -0.179433 -0.274446 -0.260644 -0.256781 -0.158840 -0.409059 -0.196237 -0.134125 -0.417070 -0.445597 0.119363 -0.627342 -0.573664 0.478665 0.130645 0.091934 0.244867 -0.453726 0.226758 0.256784 -0.427656 -0.357813 -0.353842 -0.376772 -0.267096 -0.215021 -0.262626 -0.235243 -0.224359 -0.228940 -0.663890 0.326807 0.265799 0.235309 0.212774 0.265496 0.236389 0.259104 0.214533 0.253409 0.294718 0.265381 0.302613 0.292430 0.223506 0.248182 0.264376 0.221035 0.217943 0.232520 0.225249 0.231161 0.232352 0.232786 0.230422 0.247902 0.219012
chargesum: 0.00000
title: Mulliken charges with hydrogens summed into heavy atoms:
elementType: O O O O N N C C C C C C C C C C C C C C C C C C C C C C C C C
charge: -0.179433 -0.274446 -0.260644 -0.256781 -0.158840 -0.106446 0.130571 0.131675 0.031013 0.056288 0.119363 -0.153705 -0.025536 0.478665 0.130645 0.091934 0.244867 -0.188345 0.226758 0.256784 -0.135227 -0.134306 -0.105660 -0.112396 -0.046061 0.002922 0.195143 -0.004081 0.007993 0.003846 0.033446
polarizability: 3.45732872e+02 -1.69995214e+00 3.58861048e+02 1.42977321e+01 5.31615752e+00 1.90795397e+02
1716.lowfreq: -6.9235 -3.6137 -0.0006 0.0004 0.0007 0.7899 13.6082 17.9848 20.5613
frequency: 13.5979 17.9561 20.4980 28.8884 29.6752 36.6703 50.2233 52.7078 62.7728 72.6076 82.9403 105.7003 109.6639 124.3479 133.0433 172.5732 180.5191 198.8863 215.2572 218.5918 233.3314 244.5477 269.0030 285.3142 294.6304 322.5332 337.8591 360.7758 383.1639 401.3387 411.0129 421.7527 431.3425 454.1548 456.7462 483.2599 503.9709 509.7858 535.3293 548.1622 561.3477 575.8409 583.1417 608.1247 614.2181 629.6950 640.0781 659.1093 674.4436 692.3672 707.1385 724.6082 746.3268 751.4307 754.4141 756.0871 772.6158 787.6819 794.6670 804.2515 822.0414 842.0783 858.6266 861.8961 867.5983 892.0297 906.4633 921.9085 934.0862 943.3229 945.6809 956.7948 982.0581 988.8077 989.7050 993.6425 1001.0679 1011.9959 1013.6599 1024.3749 1040.5399 1056.3571 1071.6329 1081.9371 1095.1680 1095.7053 1108.2737 1123.0447 1133.2147 1141.9230 1146.0365 1156.7140 1168.4342 1171.7798 1173.7832 1182.3357 1186.5206 1203.5996 1222.4840 1241.7967 1242.9927 1257.0359 1268.1319 1278.7185 1282.0880 1299.7130 1304.4048 1309.4485 1314.9010 1334.5214 1339.9052 1352.1688 1355.0545 1358.5056 1364.4056 1379.4690 1390.2030 1390.9510 1396.9085 1422.3398 1432.0566 1439.3866 1456.7393 1457.5971 1461.0120 1461.4598 1463.4891 1477.7929 1482.2341 1483.4359 1483.8665 1537.3076 1565.5632 1588.2666 1589.1066 1609.1181 1616.5883 1628.7490 1632.0302 2936.8076 2956.4442 2985.2736 2988.9576 2993.5093 2995.6745 3030.3685 3042.2662 3056.0294 3060.7971 3073.7558 3088.9418 3094.0456 3101.0550 3120.2640 3121.1918 3124.8103 3129.3227 3133.7543 3141.9599 3145.4810 3156.7507 3159.4314 3169.2252 3216.3064 3614.4367
redmass: 5.0120 4.2737 5.4321 5.5321 4.8830 4.6576 5.3964 4.4488 4.9163 5.8539 4.2335 3.9847 5.4538 4.3348 3.8393 5.7765 4.1452 2.3602 2.4191 3.5160 3.6050 2.4704 3.2042 2.7758 3.7863 2.7313 5.1103 5.6576 3.7901 3.2197 3.1724 3.6483 3.0392 3.4857 3.7450 4.4607 1.3217 3.3861 5.6375 4.3553 4.1847 3.0817 4.7437 4.4545 6.1875 3.4196 4.3970 4.3499 3.4326 5.5270 1.5504 3.9038 3.1564 4.5715 1.3857 3.2594 4.0288 2.2486 1.6261 1.4774 2.6127 2.3678 1.2564 1.4596 4.3368 2.3834 3.2533 2.3781 1.6434 1.5126 1.6482 3.1873 1.3980 1.3930 4.4695 2.7055 1.3535 2.8108 2.2256 2.4033 2.1635 2.8125 2.6050 1.6366 1.7026 2.1628 1.7462 1.9458 1.7561 2.6045 1.7925 1.6897 2.3256 1.2141 1.0600 1.6252 1.1499 1.4946 2.0578 1.4259 1.9191 1.5839 1.6991 1.1222 1.6256 1.3802 1.4566 1.8297 1.3326 1.4763 1.4819 1.5367 1.5226 1.4688 1.6184 8.5925 5.1334 1.2329 2.3684 2.5843 2.2243 1.0878 1.0946 1.2370 1.1332 2.4505 1.0441 1.7914 2.0309 1.6277 1.0518 8.9552 6.1639 6.2194 6.2155 6.0755 10.9265 8.4561 6.6861 1.0790 1.0713 1.0590 1.0607 1.0363 1.0630 1.0597 1.1017 1.1020 1.0961 1.0858 1.0974 1.1030 1.0908 1.1062 1.0851 1.0855 1.0900 1.0879 1.0956 1.0924 1.0961 1.1001 1.1011 1.0983 1.0808
irintensity: 0.0603 0.6914 0.1556 0.9694 0.6917 2.1165 0.9049 1.4464 1.6659 0.6537 2.6509 1.8258 4.8889 1.0971 0.2821 2.6636 0.9793 3.4095 5.7480 10.3351 1.3031 2.5525 5.4169 3.8829 0.2862 7.2042 24.5594 6.1408 7.5398 2.6210 2.8389 7.0573 13.8914 5.8454 2.9170 4.8695 85.0345 29.4460 4.9811 7.6685 9.0142 8.5144 4.9362 4.6261 0.3176 0.7632 5.5310 13.8716 4.0694 8.0554 76.9238 10.6482 10.6429 2.2165 97.4674 24.2068 1.7386 28.9460 20.2392 2.8617 4.4999 1.6374 3.6960 2.8621 1.9711 26.1677 14.0222 13.6610 16.0049 25.3989 32.3747 4.0414 0.3881 1.6467 1.0507 25.3210 1.0069 74.5041 32.0183 8.2806 1.6738 3.8606 5.9734 17.6242 25.6835 54.6162 39.4150 161.9129 28.0546 178.3897 7.2239 26.9858 23.2798 4.3966 0.3560 9.3645 3.3645 6.3314 16.1651 43.0250 1.3920 14.0980 264.8299 10.9220 6.1893 13.5509 28.2010 52.9115 4.8121 16.3118 45.1753 5.9936 54.4851 0.5297 11.6977 0.4530 33.6307 24.1510 128.1625 2.3629 9.7146 37.5807 11.8577 8.5491 4.4702 26.6482 15.1155 6.0194 0.7137 6.4924 12.4954 179.9837 18.3322 3.9211 2.5113 2.1022 151.6092 91.8393 3.5058 19.8883 26.8477 33.3746 27.9640 22.3359 32.0795 30.1697 11.5704 19.8982 12.7073 2.0046 35.7055 0.8301 12.4631 33.6916 1.0058 3.0297 16.5940 2.3666 11.9791 21.1586 22.7430 43.2481 21.9103 1.4377 62.4127
temp: 298.150 k
press: 1.00000 atm
elementType: 8 8 8 8 7 7 6 6 6 6 6 6 6 6 6 6 6 6 6 6 6 6 6 6 6 6 6 6 6 6 6 1 1 1 1 1 1 1 1 1 1 1 1 1 1 1 1 1 1 1 1 1 1 1 1 1 1
symmnumber: 1
zpe: 1204378.5 jmol-1
zpe.correction: 0.458724 hartree
zpe.thermalcorrener: 0.487170 hartree
zpe.thermalcorrenthalpy: 0.488114 hartree
zpe.thermalcorrgfe: 0.394765 hartree
zpe.sumelectzpe: -1376.452009 hartree
zpe.sumelectthermal: -1376.423562 hartree
zpe.sumelectthermalent: -1376.422618 hartree
zpe.sumelectthermalfe: -1376.515967 hartree
dipole: 5.3688 1.5526 2.1362
dipole: 5.9831
quadrupole: -168.8053 -144.0108 -189.3235
quadrupole: -2.9945 -5.2026 -5.0855
quadrupole: -1.4254 23.3691 -21.9436 -2.9945 -5.2026 -5.0855
hfenergy: -1376.9107323 hartree
pointgroup: C01 [X(C25H26N2O4)]
dipole: 2.1846798 -0.4567924 0.7480236 debye
polarizability: 347.619992|3.1147691|356.5876078|11.5700801|13.3142788|191.1817171 unknown
InChI: InChI=1S/C25H26N2O4/c1-2-31-23(28)15-18-12-13-27(25(30)17-8-4-3-5-9-17)22(24(18)29)14-19-16-26-21-11-7-6-10-20(19)21/h3-11,16,18,22,26H,2,12-15H2,1H3
charge 0 multiplicity 1
57 atoms
O  0.154741 -1.578918 -1.678226
O  -1.719267 2.582748 -0.02555
O  5.081575 -2.760467 -1.279977
O  4.197372 -2.423885 0.853078
N  0.315547 1.476365 0.215461
N  -3.183728 -3.469334 0.547544
C  -0.37314 0.202949 -0.12438
C  2.015206 -0.890301 -0.242883
C  2.599571 0.518313 0.045718
C  1.625059 1.350973 0.896068
C  0.579946 -0.800947 -0.784248
C  -1.060427 -0.440627 1.148142
C  2.91312 -1.749507 -1.149717
C  -2.091384 -1.479034 0.80787
C  -0.460103 2.638355 0.177902
C  -3.390247 -1.219797 0.205161
C  4.096823 -2.326431 -0.395157
C  -2.005571 -2.857753 0.999093
C  -4.053233 -2.487506 0.05299
C  0.222029 3.973455 0.331623
C  -4.04912 -0.03352 -0.217808
C  -5.347497 -2.601899 -0.50075
C  1.419831 4.297974 -0.357755
C  -0.432115 4.973468 1.094954
C  -5.340205 -0.143818 -0.770065
C  -5.981897 -1.410893 -0.909983
C  6.279567 -3.430711 -0.679606
C  1.96508 5.597305 -0.2653
C  0.123107 6.266212 1.201762
C  1.324773 6.581086 0.523826
C  6.010034 -4.921121 -0.457224
H  -1.176011 0.439452 -0.841421
H  1.94208 -1.408573 0.740961
H  3.558164 0.407364 0.585564
H  2.803197 1.042482 -0.908717
H  2.027582 2.353868 1.097405
H  1.479397 0.854591 1.879513
H  -1.540392 0.40629 1.67478
H  -0.290009 -0.858927 1.823492
H  3.276572 -1.181029 -2.024201
H  2.315901 -2.584948 -1.566234
H  -1.193349 -3.448237 1.420368
H  -3.372518 -4.468568 0.566456
H  -3.558997 0.942734 -0.12286
H  -5.844201 -3.572426 -0.61282
H  1.902857 3.547781 -0.994758
H  -1.380648 4.726846 1.583101
H  -5.864358 0.758724 -1.103722
H  -6.986366 -1.459354 -1.34588
H  6.528606 -2.920579 0.267507
H  7.070719 -3.258986 -1.426596
H  2.880758 5.843876 -0.813954
H  -0.383878 7.029332 1.80223
H  1.750868 7.587731 0.59896
H  5.702475 -5.41021 -1.397469
H  5.220574 -5.068231 0.2988
H  6.930132 -5.416236 -0.095068
