program: Gaussian 09
title: 000289989
version: EM64L-G09RevD.01
frameworkgroup: C1[X(C4H5N3O3)]
method: RPBEPBE
basis: SDD
operation: Freq
keyword: #pfreq=noraman
keyword: PBEPBE/SDD
title: #p freq=noraman PBEPBE/SDD
converged: NO NO NO NO
title: Mulliken charges:
elementType: O O O N N N C C C C H H H H H
charge: -0.214764 -0.214008 -0.283739 -0.047048 0.063944 -0.617134 -0.003819 0.216440 0.322826 -0.720532 0.256361 0.245825 0.256348 0.388770 0.350529
chargesum: 0.00000
title: Mulliken charges with hydrogens summed into heavy atoms:
elementType: O O O N N N C C C C
charge: -0.214764 -0.214008 -0.283739 -0.047048 0.063944 0.122165 -0.003819 0.216440 0.322826 0.038003
polarizability: 1.01582293e+02 -6.23442689e+00 9.83017961e+01 1.43106149e-04 -4.34144996e-03 3.57043493e+01
1716.lowfreq: -13.3243 -7.0348 -0.0012 -0.0011 -0.0008 10.8871 96.5908 127.8524 156.0146
frequency: 96.5817 127.8399 156.0077 203.8411 225.3336 273.8910 328.9041 364.2493 433.0107 512.7334 541.1363 578.1560 580.1567 649.8164 690.6671 710.6590 745.6755 746.9455 760.6539 969.9397 1002.1453 1043.0506 1081.2195 1134.5411 1249.8690 1351.2282 1358.3670 1406.4603 1432.0635 1450.9823 1460.2888 1503.3814 1534.0722 1653.7311 3007.7171 3095.4691 3123.0515 3422.6618 3648.4295
redmass: 8.2046 1.2743 2.7292 4.8737 5.6460 3.0648 5.8452 5.3840 9.3628 1.1499 5.2023 5.8097 5.6810 7.4676 1.4815 11.2405 9.6559 3.6330 7.3142 2.7219 1.6728 1.4955 5.9964 3.7240 7.8613 7.9112 4.2101 1.3295 1.8994 1.0433 3.4847 2.4682 1.2910 6.2016 1.0360 1.0976 1.1012 1.0527 1.0972
irintensity: 0.8910 4.1786 8.4401 8.6843 0.4837 13.2512 0.0447 0.2983 0.0207 147.6692 3.7619 8.3208 3.8671 7.2388 99.7733 5.9833 7.8921 81.0788 11.7518 40.6931 1.2976 6.4540 33.1937 67.9059 66.1667 177.5660 4.3407 32.7749 22.3607 17.6468 197.9598 54.2233 22.2591 461.2639 2.9282 5.2868 8.3465 87.3435 128.3609
temp: 298.150 k
press: 1.00000 atm
elementType: 8 8 8 7 7 7 6 6 6 6 1 1 1 1 1
symmnumber: 1
zpe: 267095.8 jmol-1
zpe.correction: 0.101731 hartree
zpe.thermalcorrener: 0.110782 hartree
zpe.thermalcorrenthalpy: 0.111726 hartree
zpe.thermalcorrgfe: 0.067736 hartree
zpe.sumelectzpe: -544.491181 hartree
zpe.sumelectthermal: -544.482130 hartree
zpe.sumelectthermalent: -544.481186 hartree
zpe.sumelectthermalfe: -544.525176 hartree
dipole: 1.3560 -2.3261 0.0018
dipole: 2.6924
quadrupole: -48.1055 -69.2933 -56.9306
quadrupole: -13.9444 0.0039 0.0006
quadrupole: 10.0043 -11.1835 1.1792 -13.9444 0.0039 0.0006
hfenergy: -544.5929125 hartree
pointgroup: C01 [X(C4H5N3O3)]
dipole: 0.6053606 -0.8692664 -0.0007187 debye
dipolederiv: -0.5227707 -0.3949771 -0.0000347 -0.0466837 -0.678519 -0.0000112 -0.0000397 -0.0001025 -0.1465432 -0.6428429 0.2418801 -0.0000093 0.321139 -0.7996195 0.0000856 0.0001237 -0.0001135 -0.2287412 -0.6707295 -0.17267 -0.0000106 -0.3807071 -0.7334187 0.000027 0.0001597 0.0001443 -0.2954981 -0.3860146 -0.002015 0.0000116 0.0575317 0.3097755 0.0000014 0.0000253 0.0000174 -0.1941856 1.7497496 -0.1893802 -0.0001137 -0.0260648 1.197816 -0.000139 -0.0002337 -0.0000929 0.2359876 -0.2882391 -0.2668128 0.0000484 0.0489195 -1.3584335 -0.0001292 0.0000559 -0.0000668 -0.6185234 -1.0358241 0.3110676 0.0001013 0.0920217 -0.6782442 -0.0000331 -0.0000449 -0.0000088 -0.089297 0.4440616 0.2156292 0.0000173 0.2855992 0.5252699 -0.0000189 -0.0000329 0.0000317 0.096402 0.7301491 0.2400874 0.0000313 -0.3824232 1.5045555 0.0002204 0.0000292 0.0002081 0.2874085 0.0470005 0.1243186 0.0000093 0.0464343 -0.1381599 -0.0000028 0.0000047 -0.0000134 0.0367848 0.0726166 0.0337248 0.0880431 0.0027139 0.0711579 -0.0031506 0.0674729 -0.0187942 -0.0005423 -0.0383053 -0.1311075 -0.0000211 -0.0414261 0.0578401 -0.0000053 -0.0000146 -0.0000086 0.1269759 0.0726376 0.0337237 -0.0880312 0.0027219 0.0711353 0.0031622 -0.0674676 0.0188233 -0.0005964 0.25968 0.0006203 -0.0000032 0.0355614 0.3176082 0.0000114 -0.0000152 0.0000193 0.3866285 0.2088311 -0.0440893 -0.0000385 -0.0153377 0.3312364 -0.0000177 -0.0000229 -0.0000435 0.4037399 unknown
polarizability: 94.1208986|-2.7699735|105.7631905|-0.0038774|0.0019581|35.7043493 unknown
InChI: InChI=1S/C4H5N3O3/c1-2-3(7(8)9)4(5)10-6-2/h5H2,1H3
charge 0 multiplicity 1
15 atoms
O  1.970768 -0.875946 0.00016
O  -2.167046 1.159708 0.000299
O  -2.172885 -1.138121 0.000539
N  2.086407 0.650759 0.00018
N  -1.548287 0.023139 0.000081
N  0.232305 -2.485617 -0.000162
C  -0.134052 -0.008526 0.000058
C  0.810032 1.08497 0.0001
C  0.63355 -1.198262 0.000008
C  0.539857 2.561177 0.000111
H  -0.054506 2.844828 0.885325
H  1.489431 3.119461 0.000228
H  -0.054306 2.844875 -0.885223
H  -0.785529 -2.630217 -0.000424
H  0.902663 -3.25203 -0.000178
