program: Gaussian 09
title: 000289988
version: EM64L-G09RevD.01
frameworkgroup: C1[X(C6H7N3O4)]
method: RPBEPBE
basis: SDD
operation: Freq
keyword: #pfreq=noraman
keyword: PBEPBE/SDD
title: #p freq=noraman PBEPBE/SDD
converged: NO NO NO NO
title: Mulliken charges:
elementType: O O O O N N N C C C C C C H H H H H H H
charge: -0.165648 -0.171477 -0.195047 -0.275288 -0.425166 -0.036975 0.070799 -0.056876 0.397515 0.217601 -0.723597 0.230892 -0.783800 0.379375 0.257233 0.257325 0.250074 0.250546 0.272029 0.250486
chargesum: 0.00000
title: Mulliken charges with hydrogens summed into heavy atoms:
elementType: O O O O N N N C C C C C C
charge: -0.165648 -0.171477 -0.195047 -0.275288 -0.045791 -0.036975 0.070799 -0.056876 0.397515 0.217601 0.041034 0.230892 -0.010739
polarizability: 1.63888300e+02 -3.35706202e+00 1.16559392e+02 -1.30717389e-03 -3.28238905e-03 5.02771577e+01
1716.lowfreq: -8.9934 -5.0138 -2.2299 -0.0008 0.0007 0.0010 40.5404 57.5708 71.5654
frequency: 40.4870 57.5530 71.5201 100.9044 108.0446 147.6372 177.7518 197.3608 248.3505 251.6045 321.2560 345.2275 356.9282 439.4446 523.8036 555.3666 567.3731 587.6818 647.6602 654.0311 728.4190 728.9516 741.1440 802.5187 860.2647 876.9885 975.5117 1006.0314 1036.0157 1043.1974 1043.4797 1084.6901 1184.9703 1237.1744 1311.0518 1353.2597 1382.5155 1402.4875 1413.9147 1432.7859 1450.3643 1453.1863 1462.7300 1485.3202 1496.2996 1586.1521 1666.5291 2993.6212 3006.9974 3078.2072 3094.5325 3122.9218 3140.9739 3284.1849
redmass: 1.5808 3.6748 2.2937 6.7345 5.5778 1.4043 2.5216 6.2053 6.2027 5.2114 3.6191 6.1672 6.7432 9.6609 5.9930 4.6289 3.2101 5.8053 8.0888 10.8144 12.9485 6.2975 7.7960 7.5944 1.1769 4.5800 2.1168 1.6226 1.6926 4.7249 1.4996 6.1403 2.8912 11.5870 6.9276 5.1258 1.2337 1.5283 2.6687 1.7103 1.1854 1.0432 1.0459 2.4631 2.2203 5.9565 6.8754 1.0384 1.0361 1.0978 1.0977 1.1011 1.0988 1.0782
irintensity: 5.4951 0.6170 3.8565 0.5806 8.8949 4.2293 4.4941 5.1247 0.4726 2.1913 0.6678 0.5279 0.7261 0.0589 27.4310 1.7506 1.3055 0.2762 12.6164 1.4437 3.6121 1.1095 2.2444 11.9270 105.9000 16.0683 56.6509 0.3915 10.6027 58.8034 6.8263 47.6088 162.7284 83.9648 492.8186 17.3608 60.9163 43.3785 28.7962 61.1985 58.2229 18.2543 21.9812 29.0901 28.6314 820.9607 94.8504 2.1715 2.2129 7.6361 4.6655 7.4985 6.4654 91.5576
temp: 298.150 k
press: 1.00000 atm
elementType: 8 8 8 8 7 7 7 6 6 6 6 6 6 1 1 1 1 1 1 1
symmnumber: 1
zpe: 361077.1 jmol-1
zpe.correction: 0.137527 hartree
zpe.thermalcorrener: 0.150265 hartree
zpe.thermalcorrenthalpy: 0.151209 hartree
zpe.thermalcorrgfe: 0.097216 hartree
zpe.sumelectzpe: -696.907759 hartree
zpe.sumelectthermal: -696.895022 hartree
zpe.sumelectthermalent: -696.894077 hartree
zpe.sumelectthermalfe: -696.948070 hartree
dipole: 0.7229 2.0157 0.0099
dipole: 2.1414
quadrupole: -65.2235 -93.8754 -72.5043
quadrupole: 17.4614 0.0019 0.0079
quadrupole: 11.9776 -16.6743 4.6968 17.4614 0.0019 0.0079
hfenergy: -697.0452861 hartree
pointgroup: C01 [X(C6H7N3O4)]
dipole: -0.2141936 -0.8147942 0.0025704 debye
dipolederiv: -0.28219 -0.1077431 -0.0001606 -0.3484218 -0.6303329 -0.0007 -0.0003807 -0.0006527 -0.1071183 -0.8797967 0.0319338 0.0004468 0.5243978 -0.7173679 -0.0007568 0.0008765 -0.0004624 -0.2896345 -1.0139664 0.2216169 0.0001821 0.1942005 -0.4789793 -0.000611 0.0027751 -0.0012402 -0.2143819 -0.5668502 -0.3224861 -0.0000925 -0.0741982 -0.7921119 -0.0004626 -0.0005264 -0.0021244 -0.280256 -2.3605008 0.0055657 0.0017057 -0.3306767 -0.4280923 0.0000395 0.0011167 -0.0002345 -0.2915497 0.0098891 0.2423236 0.0004032 0.1378968 -0.1827197 -0.0001777 0.0001916 -0.0002646 -0.1840091 1.3978984 -0.1579142 -0.0007439 -0.5226821 1.6046168 0.0030233 -0.0024911 0.0037947 0.2368722 -0.9122262 0.224733 0.0011187 0.4792849 -0.839298 -0.0020344 0.0011363 -0.0007661 -0.0819687 1.5172041 -0.2776047 -0.0016324 0.6152138 0.6577215 0.0001252 -0.0002232 0.0008517 0.2722659 0.4468384 0.2400507 0.0002679 0.1217149 0.4757172 0.0006012 -0.0002817 0.0005823 0.0969554 -0.1806393 -0.0213203 0.0001293 0.0616532 0.0812345 0.0000233 0.0004248 0.0000917 0.0356019 2.4290587 0.0254042 -0.0015176 -0.4964011 1.0220001 0.0011335 -0.0018079 0.0008411 0.2043399 -0.2464771 -0.1534854 0.0000359 -0.3134532 -0.294868 -0.0001636 -0.0002051 -0.0003213 0.0360429 0.3120078 0.004526 -0.0001032 -0.1021647 0.2302338 -0.0000813 -0.0004372 -0.0001553 0.3139749 0.0632472 -0.0033657 -0.0248659 0.0326484 0.0810189 0.0835519 -0.0316018 0.0599801 0.0021109 0.0633994 -0.0034977 0.0247675 0.0324805 0.0815211 -0.0833167 0.03147 -0.059719 0.0017381 0.0989434 0.0022711 0.0000081 -0.0934577 -0.068402 -0.0002524 -0.0001803 -0.0003304 0.1282927 0.0789108 0.0152524 0.0705149 0.0032847 0.0591787 -0.073148 0.0350427 -0.0906941 -0.0082787 -0.0534497 0.0181847 0.0001787 0.0751874 0.0801822 -0.0001192 0.0002631 -0.000062 0.1367873 0.0786991 0.0155549 -0.0706426 0.0034925 0.0587475 0.0733261 -0.0351615 0.0908857 -0.0077852 unknown
polarizability: 164.1116608|0.8035681|116.3357309|-0.0844524|0.1248361|50.2774583 unknown
InChI: InChI=1S/C6H7N3O4/c1-3-5(9(11)12)6(13-8-3)7-4(2)10/h7H,1-2H3
charge 0 multiplicity 1
20 atoms
O  -0.423356 1.706799 0.00267
O  -3.197325 1.124928 0.003206
O  2.693468 -1.685743 -0.006474
O  0.503119 -2.361905 -0.006626
N  -1.469534 -0.467854 0.000532
N  1.008794 2.236925 0.002673
N  1.430556 -1.423914 -0.002447
C  0.991267 -0.072996 -0.000377
C  -0.362473 0.338048 0.000863
C  1.784258 1.135075 0.00076
C  3.276431 1.287341 0.000142
C  -2.845156 -0.074886 0.001719
C  -3.790461 -1.264968 0.001094
H  -1.20005 -1.471546 -0.00062
H  3.716229 0.796288 0.884909
H  3.715237 0.799005 -0.886623
H  3.545262 2.355489 0.001612
H  -3.633949 -1.896519 -0.892649
H  -4.826125 -0.897112 0.002367
H  -3.632491 -1.898653 0.893067
