program: Gaussian 09
title: 000289987
version: EM64L-G09RevD.01
frameworkgroup: C1[X(C6H8N2O2)]
method: RPBEPBE
basis: SDD
operation: Freq
keyword: #pfreq=noraman
keyword: PBEPBE/SDD
title: #p freq=noraman PBEPBE/SDD
converged: NO NO NO NO
title: Mulliken charges:
elementType: O O N N C C C C C C H H H H H H H H
charge: -0.245183 -0.238321 -0.390966 -0.058952 0.346437 0.222532 -0.462656 -0.752652 0.225145 -0.783159 0.307052 0.336205 0.236778 0.250390 0.250397 0.242773 0.271342 0.242838
chargesum: 0.00000
title: Mulliken charges with hydrogens summed into heavy atoms:
elementType: O O N N C C C C C C
charge: -0.245183 -0.238321 -0.054761 -0.058952 0.346437 0.222532 -0.155604 -0.015087 0.225145 -0.026207
polarizability: 1.30511920e+02 1.69163454e+00 8.26762780e+01 7.03802876e-03 6.65200624e-03 4.64667235e+01
1716.lowfreq: -119.5090 -61.1003 -0.0010 -0.0006 0.0005 3.2282 5.0566 10.4596 84.3204
frequency: -119.5047 -61.0280 84.2586 86.3338 123.4133 217.4310 275.9899 327.5145 349.2364 392.5981 541.3062 567.6233 610.3878 622.7881 645.9894 671.8461 759.6774 811.2557 841.6168 924.8842 946.6711 966.1641 994.7648 1004.8849 1033.5328 1048.2237 1145.5689 1189.3628 1241.0618 1379.3257 1388.2473 1402.4011 1441.8535 1446.8824 1464.4520 1466.1893 1479.7436 1501.9161 1606.5763 1635.8868 2992.1906 3003.6996 3077.2863 3090.5596 3113.6561 3142.7375 3280.0551 3529.8611
redmass: 1.0397 1.0550 3.4367 6.2855 4.4615 3.4582 4.1251 4.0891 5.8700 3.9253 4.2169 3.6508 4.9597 1.1998 4.9960 3.7786 5.9208 8.3963 1.3020 6.4879 3.3373 2.3801 1.8585 2.0007 1.6591 1.4925 1.9693 2.2068 3.7059 1.2461 3.3293 1.2531 4.0662 1.2794 1.0434 1.0460 1.1946 2.0102 5.9361 8.1227 1.0384 1.0366 1.0983 1.0985 1.0999 1.0982 1.1000 1.0770
irintensity: 0.7223 0.3937 7.7481 13.0797 8.8362 2.3803 1.5985 1.3042 0.0106 3.5175 8.9662 0.2798 9.1676 96.7503 14.8720 4.1328 5.9393 6.8029 43.5880 1.4842 19.8321 1.1686 22.4554 0.7295 9.7533 9.7945 1.4272 9.5282 132.6673 51.6865 0.9965 18.3661 41.0103 88.9476 14.1854 21.7036 53.1851 349.2146 166.6139 171.9961 5.8974 15.9093 11.9195 11.7281 11.9553 5.7018 4.7875 40.8394
temp: 298.150 k
press: 1.00000 atm
elementType: 8 8 7 7 6 6 6 6 6 6 1 1 1 1 1 1 1 1
symmnumber: 1
zpe: 358089.6 jmol-1
zpe.correction: 0.136389 hartree
zpe.thermalcorrener: 0.145048 hartree
zpe.thermalcorrenthalpy: 0.145993 hartree
zpe.thermalcorrgfe: 0.102159 hartree
zpe.sumelectzpe: -492.609219 hartree
zpe.sumelectthermal: -492.600559 hartree
zpe.sumelectthermalent: -492.599615 hartree
zpe.sumelectthermalfe: -492.643449 hartree
dipole: -2.3899 -0.4373 0.0021
dipole: 2.4296
quadrupole: -47.7351 -63.8417 -59.2460
quadrupole: 16.2661 0.0027 0.0005
quadrupole: 9.2058 -6.9007 -2.3051 16.2661 0.0027 0.0005
hfenergy: -492.7456076 hartree
pointgroup: C01 [X(C6H8N2O2)]
dipole: 0.9290604 -0.2248198 -0.0007116 debye
dipolederiv: -0.5168593 0.2572835 -0.0010321 0.0518289 -0.5101553 0.0015838 0.0001278 0.0014861 -0.1454288 -0.5512966 0.1015579 -0.0002199 -0.5078522 -0.8996668 0.0029914 0.0025292 0.0024334 -0.3284812 -1.7641062 -0.2013195 0.0023488 -0.405886 -0.4929289 0.0012419 0.0032035 0.001014 -0.3017194 -0.1675328 -0.2131572 0.0010364 -0.1685307 -0.0782058 -0.0002055 0.000774 -0.0002949 -0.1954405 1.2187719 -0.1495191 -0.0002953 -0.4362382 0.4790619 -0.0008932 0.0008156 -0.0012812 0.1584202 0.7161189 -0.1817876 0.0007635 -0.0115342 0.1437836 -0.0008691 0.0010725 -0.0013586 0.0320276 -0.622266 0.1680116 -0.0004345 0.332073 -0.2233002 -0.0004753 -0.0014337 -0.0001632 -0.2351845 -0.098277 0.110982 -0.0005411 0.05687 0.0334067 0.0003128 -0.0019675 0.0016478 0.0506617 1.65986 0.129913 -0.00209 0.9754695 1.2182797 -0.0054647 -0.0060348 -0.0046389 0.1864322 -0.4049597 0.1199854 -0.0000474 0.2270366 -0.096677 0.0003245 -0.0001933 0.0003671 0.0496691 0.1397918 -0.0412949 0.0003345 -0.0355992 0.0772367 0.0006464 0.0003386 0.000583 0.2226514 0.1690316 -0.015036 0.0002352 -0.0060479 0.1791404 0.0006884 0.000203 0.0007147 0.3334265 0.0613296 -0.0888602 -0.0007006 -0.005517 -0.0947276 -0.0011995 -0.0000378 -0.0012951 0.1223453 0.0165632 0.0207293 -0.0864105 -0.0033367 0.0809175 -0.0530159 -0.1200242 -0.0143093 -0.0214391 0.0152708 0.0195126 0.0869219 -0.0059045 0.0805817 0.0542747 0.1205839 0.0150114 -0.0183825 0.0570198 0.004515 0.0212783 0.0274875 0.0465717 0.104102 -0.0284199 0.1060933 -0.0224994 0.0145473 -0.0457409 0.0002423 -0.1118537 0.0116011 0.0005307 0.0004309 0.0005149 0.1338599 0.0569925 0.0042253 -0.0213894 0.0275347 0.0450807 -0.1045734 0.0280321 -0.1065243 -0.0209185 unknown
polarizability: 130.1689374|-4.3761012|83.0184214|-0.0548377|-0.1681|46.4675624 unknown
InChI: InChI=1S/C6H8N2O2/c1-4-3-6(10-8-4)7-5(2)9/h3,7H,1-2H3
charge 0 multiplicity 1
18 atoms
O  -0.912623 -1.523127 0.00787
O  2.116364 1.443964 -0.008358
N  1.297684 -0.740392 0.002125
N  -2.307719 -1.015278 0.007033
C  -0.057081 -0.417736 0.002019
C  -2.165554 0.335407 0.000877
C  -0.788782 0.75911 -0.002448
C  -3.395084 1.20801 -0.002301
C  2.342579 0.201613 -0.003061
C  3.736642 -0.414572 -0.001834
H  -0.39423 1.768728 -0.007295
H  1.522586 -1.73887 0.006344
H  -3.109949 2.271973 0.003652
H  -4.011688 1.016688 -0.897448
H  -4.021758 1.0090 0.88404
H  3.895048 -1.040892 0.895305
H  4.478695 0.395664 -0.005373
H  3.89367 -1.047391 -0.894647
