program: Gaussian 09
title: 000289982
version: EM64L-G09RevD.01
frameworkgroup: C1[X(C21H20O5)]
method: RPBEPBE
basis: SDD
operation: Freq
keyword: #pfreq=noraman
keyword: PBEPBE/SDD
title: #p freq=noraman PBEPBE/SDD
converged: YES YES NO NO
title: Mulliken charges:
elementType: O O O O O C C C C C C C C C C C C C C C C C C C C C H H H H H H H H H H H H H H H H H H H H
charge: -0.214300 -0.269395 -0.457560 -0.202796 -0.294400 -0.191542 -0.218177 -0.115397 -0.078373 -0.499179 -0.583425 -0.334858 0.204493 0.218510 0.204508 -0.360899 -0.341446 -0.389004 -0.383120 0.365240 0.339980 -0.387838 -0.388309 -0.234905 -0.235176 -0.236784 0.255125 0.273615 0.259225 0.299823 0.272502 0.222023 0.261376 0.264088 0.198315 0.190816 0.377276 0.268329 0.279549 0.244316 0.247347 0.240329 0.239264 0.229136 0.228924 0.232771
chargesum: 0.00000
title: Mulliken charges with hydrogens summed into heavy atoms:
elementType: O O O O O C C C C C C C C C C C C C C C C C C C C C
charge: -0.214300 -0.269395 -0.080284 -0.202796 -0.294400 0.063583 0.055438 0.143828 0.221450 -0.004653 -0.057962 0.054274 0.204493 0.218510 0.204508 -0.092570 -0.061896 -0.144688 -0.135773 0.365240 0.339980 -0.147508 -0.149045 -0.005769 -0.006252 -0.004013
polarizability: 3.92170001e+02 3.67108161e+01 2.09738004e+02 -2.03134073e+01 2.27815700e+01 1.64330011e+02
1716.lowfreq: -14.1482 -3.7702 -2.1021 -0.0010 -0.0008 -0.0004 15.1694 23.9211 30.9548
frequency: 15.0814 23.8607 30.8839 38.8870 53.8958 64.9674 76.5634 80.2620 104.9142 115.0942 144.2337 156.6113 177.4397 216.9199 236.1538 250.3330 292.9944 306.5171 326.1576 342.8348 371.9063 403.1746 405.1374 411.0733 439.3632 464.0792 478.7140 488.7384 510.2989 529.0847 541.5726 549.2507 569.8226 612.8800 633.8714 640.4470 653.7080 687.1036 699.7087 701.3119 735.7928 748.4109 764.5636 780.2923 790.3277 806.1156 816.8746 844.7816 850.9854 855.4099 858.7519 865.8777 899.5344 917.6575 924.9452 976.0453 977.8492 987.3392 987.9169 988.2809 993.7291 997.0651 997.1898 1013.2118 1014.5809 1028.9270 1039.5153 1049.3436 1063.3005 1070.7600 1082.8503 1086.2899 1096.3669 1117.6703 1126.2226 1168.9118 1175.0814 1175.8690 1191.3288 1199.9485 1203.8008 1218.1500 1233.4668 1259.2423 1265.1177 1270.6425 1286.7949 1291.7299 1303.2777 1306.4540 1308.4335 1316.6980 1321.9669 1330.8956 1343.5354 1360.9328 1362.4715 1378.1833 1412.9200 1420.4140 1438.4171 1438.6117 1443.1339 1475.7077 1489.6837 1511.7413 1556.1417 1583.0229 1591.5394 1611.4445 1619.2330 1705.7301 2944.0904 2983.3362 3009.6714 3017.1062 3018.1183 3030.8970 3044.9150 3054.6497 3091.6300 3098.5259 3125.8084 3130.1756 3140.8294 3143.0080 3147.3021 3152.0523 3164.1727 3167.4291 3174.8843 3361.6238
redmass: 6.3991 5.0498 5.8945 6.0126 6.6097 5.9956 4.1302 3.5445 5.5515 6.4439 6.0172 6.2764 4.7926 4.0706 4.4574 6.0784 3.9869 5.3894 3.0295 4.4747 3.8383 3.4236 3.5614 2.9867 3.5319 4.5756 4.5060 4.2744 3.3609 1.2291 2.8605 3.0027 4.3059 6.5514 6.8791 6.8728 5.3751 4.2425 4.3957 1.8482 6.1237 2.5593 5.7014 2.4759 4.0686 5.2485 3.0791 3.1745 1.3103 1.7283 1.9925 1.6671 2.9607 2.2359 1.4528 1.4745 2.6656 2.3811 2.5241 2.1655 2.0139 1.3641 3.0817 2.8464 2.3885 2.1543 1.9863 3.0736 2.1051 4.0521 2.4224 1.6275 3.5184 2.0469 1.3987 1.1777 1.0535 1.4240 1.1171 1.1604 1.1505 1.4681 1.5917 2.4608 1.4353 1.6040 1.4399 3.0659 1.3534 1.3972 1.2858 1.3646 1.2702 1.3992 1.5532 1.5549 2.5240 10.0827 1.1688 4.1183 2.3228 1.1013 1.0823 2.1595 1.0921 2.8356 7.0734 6.9591 8.1770 5.9822 6.2440 12.6210 1.0577 1.1023 1.0672 1.0836 1.0700 1.0843 1.0864 1.0891 1.0978 1.0989 1.0847 1.0875 1.0893 1.0903 1.0895 1.0959 1.0963 1.1016 1.0964 1.0691
irintensity: 1.5671 1.8674 0.7161 13.9940 2.3272 1.8708 1.2652 3.0303 3.0829 2.1671 0.7409 1.3308 0.8417 6.1511 0.8690 11.7102 0.4722 4.0501 5.5588 5.7142 5.1626 1.5831 6.5089 0.9492 1.5729 8.1894 10.3670 14.8878 6.6470 105.2737 15.1049 1.5145 13.6326 0.0764 0.2118 0.8494 3.2131 14.2590 6.0160 51.9744 1.7131 72.4239 3.5869 25.7749 9.1641 2.4270 13.8238 15.4744 1.0265 16.2993 12.1544 39.2451 10.6878 4.7424 1.7421 4.0063 48.5374 0.3571 17.5848 16.8896 21.0222 0.3045 8.0591 27.5689 26.9159 28.4422 17.5278 10.9179 66.4067 335.0427 8.2972 7.0607 153.1187 6.7457 5.3776 17.0981 0.0563 4.5639 21.4413 101.6739 14.0045 9.0946 15.1076 351.0625 6.1556 31.5196 2.7954 12.4957 29.9138 2.6666 7.9735 2.2034 1.3864 42.5454 3.9317 3.0795 9.6267 1.3073 77.0048 22.6794 9.7780 21.5504 18.1844 27.9032 0.6881 14.0003 93.7898 156.5159 154.1047 7.6761 143.8107 300.2892 111.9680 28.7599 8.2840 17.2285 22.2749 13.5909 20.5393 69.7614 6.8123 5.5967 6.1289 0.4322 14.3117 7.9402 1.4041 36.1119 6.5801 30.2874 2.2055 478.8966
temp: 298.150 k
press: 1.00000 atm
elementType: 8 8 8 8 8 6 6 6 6 6 6 6 6 6 6 6 6 6 6 6 6 6 6 6 6 6 1 1 1 1 1 1 1 1 1 1 1 1 1 1 1 1 1 1 1 1
symmnumber: 1
zpe: 954449.7 jmol-1
zpe.correction: 0.363531 hartree
zpe.thermalcorrener: 0.385750 hartree
zpe.thermalcorrenthalpy: 0.386694 hartree
zpe.thermalcorrgfe: 0.308987 hartree
zpe.sumelectzpe: -1186.509837 hartree
zpe.sumelectthermal: -1186.487618 hartree
zpe.sumelectthermalent: -1186.486674 hartree
zpe.sumelectthermalfe: -1186.564381 hartree
dipole: -0.2346 1.0021 0.9334
dipole: 1.3894
quadrupole: -108.4600 -176.6133 -147.2008
quadrupole: -15.1154 -4.0008 5.8482
quadrupole: 35.6313 -32.5219 -3.1094 -15.1154 -4.0008 5.8482
hfenergy: -1186.8733679 hartree
pointgroup: C01 [X(C21H20O5)]
dipole: 0.1736405 -0.135778 0.5002112 debye
polarizability: 376.5790348|62.1957991|190.763151|-20.5497855|-38.7763257|198.89583 unknown
InChI: InChI=1S/C21H20O5/c22-12-17-16-10-20(23)25-18(16)11-19(17)26-21(24)15-8-6-14(7-9-15)13-4-2-1-3-5-13/h1-9,16-19,22H,10-12H2
charge 0 multiplicity 1
46 atoms
O  3.499926 -1.462251 1.169302
O  1.679921 0.963848 0.262309
O  3.559512 2.821514 -2.615948
O  2.454934 -3.261081 0.137506
O  0.973369 2.224757 -1.567434
C  4.58632 -0.439033 -0.757481
C  3.654902 0.710537 -1.270147
C  4.492417 -0.402336 0.802585
C  3.080881 1.425985 -0.008935
C  3.941183 0.977292 1.181865
C  4.121133 -1.867261 -1.116832
C  4.396538 1.706867 -2.191172
C  3.252048 -2.31395 0.067782
C  0.706152 1.430704 -0.617642
C  -0.641293 0.894877 -0.314492
C  -1.754057 1.4063 -1.032961
C  -0.843739 -0.123292 0.655184
C  -3.045256 0.915265 -0.778467
C  -2.138184 -0.616137 0.895189
C  -3.266264 -0.107372 0.189242
C  -4.635975 -0.631537 0.450921
C  -5.007405 -1.092202 1.745098
C  -5.609406 -0.684759 -0.585917
C  -6.304741 -1.586798 1.994123
C  -6.906409 -1.180923 -0.338277
C  -7.261614 -1.634009 0.953617
H  5.62505 -0.256711 -1.086518
H  2.813428 0.284828 -1.848486
H  5.433018 -0.66221 1.317981
H  3.045119 2.521397 -0.141257
H  3.372041 0.954667 2.125124
H  4.784533 1.68163 1.307358
H  4.969465 -2.573417 -1.196742
H  3.547348 -1.937398 -2.054518
H  4.774576 1.160554 -3.081863
H  5.274487 2.134281 -1.66237
H  2.59962 2.645471 -2.390951
H  -1.585388 2.192683 -1.775823
H  0.016182 -0.533941 1.192181
H  -3.898065 1.346912 -1.312747
H  -2.272368 -1.432071 1.612803
H  -4.287118 -1.033867 2.568841
H  -5.339965 -0.36796 -1.599776
H  -6.571817 -1.927485 3.000575
H  -7.63653 -1.223112 -1.154083
H  -8.268911 -2.019054 1.14645
