program: Gaussian 09
title: 000027956
version: EM64L-G09RevD.01
frameworkgroup: C1[X(C12H20N2O3)]
method: RPBEPBE
basis: SDD
operation: Freq
keyword: #p
keyword: freq=noraman
keyword: PBEPBE/SDD
title: #p freq=noraman PBEPBE/SDD
converged: YES YES NO NO
title: Mulliken charges:
elementType: O O O N N C C C C C C C C C C C C H H H H H H H H H H H H H H H H H H H H
charge: -0.308411 -0.292780 -0.312266 -0.320528 -0.595105 -0.026598 -0.568128 0.597055 -0.741282 -0.596629 -0.582502 0.276070 0.247933 0.014865 -0.527828 -0.525514 -0.524526 0.212715 0.213483 0.244013 0.246533 0.202471 0.221833 0.261609 0.262638 0.252808 0.264705 0.298137 0.220152 0.225892 0.252533 0.212752 0.260966 0.225892 0.230348 0.224013 0.252678
chargesum: 0.00000
title: Mulliken charges with hydrogens summed into heavy atoms:
elementType: O O O N N C C C C C C C C C C C C
charge: -0.308411 -0.292780 -0.312266 -0.067719 -0.032263 0.186117 -0.110632 0.597055 -0.070445 -0.335019 -0.319864 0.276070 0.247933 0.014865 0.170748 0.174096 0.182514
polarizability: 2.06695959e+02 3.45198592e+00 1.66200710e+02 -9.49586190e+00 2.74001183e-01 1.12339939e+02
1716.lowfreq: -6.0348 -0.0009 -0.0008 -0.0004 6.9560 10.9194 26.1857 40.6362 50.4881
frequency: 25.8605 40.6133 50.4582 75.0893 83.2836 91.5093 96.1433 125.3633 146.8469 158.6901 167.1643 173.6902 195.1446 205.2025 219.9725 229.6574 252.2706 277.0470 299.6220 322.6699 332.6186 351.5502 370.8172 423.0758 447.1768 454.3027 475.4155 500.3739 523.3705 570.2107 594.6405 640.8741 658.5671 690.8769 742.6566 763.9411 833.9917 866.9067 888.3073 891.0715 898.8749 911.5657 940.3815 943.0674 1009.5695 1025.8972 1064.1457 1076.1129 1111.9092 1112.5532 1112.6651 1115.2445 1146.7699 1151.4625 1156.0978 1158.8935 1165.4366 1184.3005 1204.7813 1217.0002 1219.0280 1270.2398 1305.1696 1321.5246 1339.3601 1358.9042 1382.3956 1397.1211 1418.7833 1435.3633 1438.0337 1454.1993 1456.8881 1457.6523 1459.9857 1465.8404 1468.7954 1476.9448 1477.6138 1479.6197 1485.0361 1487.5296 1568.5931 1607.5329 1648.3625 2875.8781 2970.2387 2971.2825 2973.7116 2975.2262 2991.6121 3054.8758 3063.4560 3069.7449 3074.7515 3076.2308 3095.5501 3117.2244 3118.0274 3121.9028 3148.0345 3152.4581 3341.5682 3404.7053 3589.9714
redmass: 3.4233 3.8493 3.8034 2.9756 3.3080 2.6431 2.8614 3.1303 1.2715 1.2861 1.5111 1.3858 3.2593 1.5712 3.0529 1.9216 4.5741 3.7657 2.2151 2.5256 3.2307 2.3057 4.7245 1.7146 4.9190 1.5092 4.6228 3.5724 3.9352 3.4921 5.0391 4.2604 3.1999 2.0123 4.4284 3.6801 2.2049 5.4529 1.8206 1.4249 1.5215 4.4117 1.6962 8.0752 4.3024 4.3589 2.7466 1.6443 1.8368 1.5073 1.2413 1.3567 2.5270 1.3580 1.4175 1.4449 1.8883 2.0253 1.4362 1.4681 1.6820 1.3618 5.1630 1.4123 1.3352 6.7967 1.2489 2.0217 1.2611 1.2460 1.5288 1.2181 1.1118 1.0852 1.0681 2.0042 1.1102 1.0763 1.0586 1.0699 1.0554 1.0573 7.4489 7.0950 1.0873 1.0821 1.0331 1.0317 1.0373 1.0299 1.0590 1.1029 1.0980 1.1025 1.1045 1.0996 1.0985 1.1032 1.1031 1.1042 1.0914 1.0922 1.0748 1.0479 1.0957
irintensity: 1.0104 0.5472 3.0704 2.6369 0.7834 2.5746 8.7594 3.8391 0.3023 0.9931 3.1544 1.6063 4.7732 2.5908 3.4693 2.9424 10.3945 6.7210 28.7385 7.4868 10.2140 6.7442 2.4114 71.1173 1.3001 154.4276 5.0625 15.6457 5.9625 15.4392 2.6704 7.7026 50.4050 58.2285 14.6016 9.7129 16.4751 7.8727 4.9673 8.3082 2.8731 55.8322 13.6553 50.7360 69.6093 135.1260 3.8392 32.1326 21.3680 10.8343 5.9697 4.2088 6.8509 1.7853 7.3148 14.1054 11.8876 49.4127 18.3906 10.2708 2.5050 48.7656 96.8024 1.7786 13.5652 15.3356 23.7776 52.8924 3.9908 21.6976 18.5534 36.9154 11.9794 11.8573 1.5948 39.7219 5.9302 12.0170 3.6703 1.7659 21.0470 25.2306 78.7917 61.6588 8.0543 63.0689 62.3301 126.1312 30.3560 52.4485 19.0742 15.8680 40.1207 26.4728 22.5344 33.0030 26.0683 26.1912 25.8863 18.3917 4.8308 2.9436 21.5966 16.4826 4.0176
temp: 298.150 k
press: 1.00000 atm
elementType: 8 8 8 7 7 6 6 6 6 6 6 6 6 6 6 6 6 1 1 1 1 1 1 1 1 1 1 1 1 1 1 1 1 1 1 1 1
symmnumber: 1
zpe: 807663.2 jmol-1
zpe.correction: 0.307623 hartree
zpe.thermalcorrener: 0.327632 hartree
zpe.thermalcorrenthalpy: 0.328576 hartree
zpe.thermalcorrgfe: 0.258654 hartree
zpe.sumelectzpe: -803.014845 hartree
zpe.sumelectthermal: -802.994836 hartree
zpe.sumelectthermalent: -802.993892 hartree
zpe.sumelectthermalfe: -803.063814 hartree
dipole: 0.3981 1.5046 0.4638
dipole: 1.6240
quadrupole: -77.8894 -101.2409 -98.4789
quadrupole: 3.4557 4.0890 0.2536
quadrupole: 14.6470 -8.7045 -5.9425 3.4557 4.0890 0.2536
hfenergy: -803.3224679 hartree
pointgroup: C01 [X(C12H20N2O3)]
dipole: 0.1106583 -0.592522 -0.2118688 debye
polarizability: 205.4236474|-7.3314716|166.9668967|11.001968|2.218286|112.8460644 unknown
InChI: InChI=1S/C12H20N2O3/c1-8(14-13)5-9-6-10(15-2)12(17-4)11(7-9)16-3/h6-8,14H,5,13H2,1-4H3
charge 0 multiplicity 1
37 atoms
O  -1.647623 -2.292336 -0.526287
O  -1.712895 2.626159 0.091956
O  -3.137384 0.18212 -0.555211
N  4.796298 -0.309686 -0.208617
N  4.984014 -1.601294 0.360355
C  3.388731 -0.017559 -0.597545
C  2.524691 0.120298 0.687924
C  1.032311 0.134645 0.40731
C  3.383671 1.260965 -1.455768
C  0.29281 1.341003 0.434023
C  0.349264 -1.072354 0.10695
C  -1.029571 -1.064579 -0.180696
C  -1.089657 1.363209 0.133786
C  -1.761959 0.156526 -0.204158
C  -2.737043 -2.718842 0.380878
C  -2.954023 2.786067 0.88051
C  -3.378892 -0.091754 -1.993293
H  2.961796 -0.856262 -1.201087
H  2.838124 1.040917 1.214808
H  2.792436 -0.741499 1.327998
H  2.351178 1.54179 -1.723588
H  3.951828 1.119548 -2.396008
H  3.840869 2.097921 -0.89611
H  0.776421 2.291825 0.681315
H  0.874778 -2.033262 0.108221
H  5.4499 -0.092786 -0.980016
H  5.090105 -2.398739 -0.279924
H  5.605971 -1.604189 1.169017
H  -2.335804 -2.901282 1.396233
H  -3.119998 -3.659471 -0.044242
H  -3.536317 -1.957683 0.422438
H  -2.740621 2.644228 1.957985
H  -3.725899 2.071775 0.549745
H  -3.27693 3.822609 0.697905
H  -2.900372 0.68805 -2.614335
H  -4.472053 -0.05934 -2.121433
H  -2.987154 -1.088734 -2.264541
