program: Gaussian 09
title: 000289942
version: EM64L-G09RevD.01
frameworkgroup: C1[X(C20H27N3O3)]
method: RPBEPBE
basis: SDD
operation: Freq
keyword: #p
keyword: freq=noraman
keyword: PBEPBE/SDD
title: #p freq=noraman PBEPBE/SDD
converged: YES YES NO NO
title: Mulliken charges:
elementType: O O O N N N C C C C C C C C C C C C C C C C C C C C H H H H H H H H H H H H H H H H H H H H H H H H H H H
charge: -0.252895 -0.293250 -0.261924 -0.164987 -0.156893 -0.245754 -0.269147 -0.342503 -0.426803 -0.321020 0.026814 0.180532 -0.440698 -0.427371 0.537057 -0.394797 -0.394170 -0.392680 0.251064 -0.398234 -0.391378 -0.768572 -0.363797 -0.389219 0.322218 -0.537398 0.282640 0.265310 0.230813 0.247394 0.289976 0.248985 0.294646 0.192907 0.212802 0.223394 0.194497 0.200663 0.201134 0.201290 0.203706 0.203837 0.190529 0.262539 0.232124 0.238928 0.241459 0.273006 0.253197 0.240135 0.220791 0.247788 0.221315
chargesum: 0.00000
title: Mulliken charges with hydrogens summed into heavy atoms:
elementType: O O O N N N C C C C C C C C C C C C C C C C C C C C
charge: -0.252895 -0.293250 -0.261924 -0.164987 -0.156893 0.048892 0.013493 -0.077194 0.051403 -0.031044 0.275800 0.180532 -0.034989 -0.009480 0.537057 0.007000 0.010826 0.001686 0.251064 -0.135696 -0.159254 -0.015178 -0.110600 -0.149084 0.322218 0.152496
polarizability: 3.19193701e+02 1.73037511e+01 2.10163813e+02 -1.43878469e+00 -1.71852169e+01 1.99434568e+02
1716.lowfreq: -7.1542 0.0005 0.0008 0.0010 1.1964 4.9418 17.0255 20.4491 27.5839
frequency: 16.1664 20.4284 27.2713 30.7853 35.2935 52.6613 74.5110 80.8481 89.8187 102.1180 109.3582 128.7939 154.1287 176.4851 189.6405 211.6735 217.3582 234.6110 238.0343 259.8941 280.8996 315.7150 321.8484 335.4155 357.5563 380.3616 414.4603 429.2939 437.5702 447.2995 464.1542 482.3548 496.9848 526.3992 539.6033 552.1615 572.1978 605.5610 617.6678 633.0489 676.9789 690.9809 729.8700 733.7258 758.4571 768.4797 785.5119 791.8147 801.5207 820.6988 833.9867 844.5089 860.6467 868.1732 877.2093 889.5411 896.2929 919.8912 930.8521 947.4827 960.5909 978.6138 980.8996 989.4163 998.6200 1005.3269 1034.9607 1040.2751 1044.5051 1046.5883 1058.7754 1063.4454 1074.4110 1076.1100 1109.9827 1111.5585 1111.9081 1117.7141 1149.5279 1157.4182 1178.5719 1184.0485 1189.3396 1196.6020 1200.4324 1218.2809 1232.4512 1240.7393 1245.7441 1253.5812 1258.3550 1260.4631 1273.0269 1289.8733 1306.6168 1308.2270 1310.4838 1329.9087 1335.0202 1339.6984 1341.4031 1342.5940 1346.9511 1355.9370 1364.7623 1378.1409 1395.1609 1413.5979 1424.2962 1436.3385 1442.0754 1451.7184 1459.5075 1461.9330 1463.9086 1464.6664 1467.5708 1471.6358 1472.6357 1478.2795 1496.2093 1503.1869 1578.4883 1584.6557 1623.3640 1637.9847 2959.3501 2963.6454 2967.3770 2969.3621 2972.1367 2973.9516 2975.3956 2998.1470 2999.0136 3029.1521 3031.2273 3032.1874 3037.6981 3041.0943 3047.2199 3049.7476 3050.2659 3055.0010 3077.0197 3090.4601 3121.9551 3126.7022 3132.9958 3134.1907 3159.7827 3169.1721 3366.0335
redmass: 4.7562 4.8997 4.8553 3.7290 3.4052 5.8258 3.7080 4.1745 3.0122 1.2632 2.9128 3.4438 3.9924 3.3188 4.4838 3.6109 1.7958 1.4596 4.3504 3.2850 4.1038 3.4672 2.8410 2.1193 4.0956 4.6828 2.9606 3.3430 3.7187 3.8288 4.3134 1.8143 3.2474 3.2910 4.9805 3.1271 3.4230 4.5134 5.4178 6.5486 4.0316 4.9786 3.8434 4.3830 4.2108 2.5639 1.5320 2.2230 1.9755 2.1414 2.2203 2.1534 2.7152 3.1826 1.8978 2.4880 1.5636 1.8092 1.4311 2.7330 2.7437 1.3840 2.5346 4.5175 2.5991 2.4442 2.4251 1.7716 1.8262 1.8211 1.2142 2.4081 1.6511 1.9065 4.0380 2.6293 1.2768 1.4011 2.5185 1.3425 1.3935 1.4848 1.6038 1.6107 1.9490 1.7359 2.7690 1.7842 1.5806 1.4766 1.3209 1.2817 1.6575 1.3548 1.3932 1.4426 1.3620 1.3745 1.3635 1.6681 1.4495 1.6437 1.4289 1.9891 1.7835 1.2691 2.8848 2.1589 2.7367 1.1677 1.2018 1.1241 1.0893 1.0915 1.0879 1.2040 1.0501 1.0846 1.0737 1.1000 1.0959 2.4641 7.1133 7.0113 6.2609 10.7462 1.0330 1.0629 1.0637 1.0636 1.0620 1.0624 1.0631 1.0811 1.0379 1.1005 1.0972 1.0960 1.1000 1.1023 1.1040 1.0871 1.1023 1.0858 1.0884 1.0939 1.0885 1.0991 1.1023 1.0901 1.0938 1.0956 1.0763
irintensity: 0.7589 0.7132 0.5746 0.9519 0.0997 3.9292 1.1252 2.5674 4.3483 1.0381 9.6292 0.0130 0.7665 3.0246 6.6266 3.9803 0.1017 0.2666 6.7657 0.3351 1.4213 7.9221 5.2088 2.5998 6.4322 2.3752 0.1040 2.4148 3.7187 1.7028 3.3502 0.4968 5.6610 24.3783 16.4964 0.2534 17.8301 32.8241 2.7085 3.0815 7.0314 18.5632 2.3500 31.7491 10.5089 36.8959 3.4493 24.2582 15.1835 4.3211 13.6373 5.5376 14.6951 30.0630 3.3327 0.6065 16.4609 0.2996 1.5315 2.4158 9.3673 0.2566 33.3964 25.8840 15.2187 3.6282 4.0378 9.6785 1.5993 0.7743 0.5657 1.1251 1.3576 1.4492 26.7857 3.0353 0.7425 10.3056 1.6883 0.4393 43.7281 65.5317 9.3152 6.1615 9.8928 8.5525 133.4412 70.0768 89.6011 9.2588 9.4116 4.9477 58.9917 17.5286 12.4539 37.9364 15.4364 19.2723 0.9502 4.3599 0.6828 5.1194 0.3312 72.0271 26.6274 72.7392 3.5082 49.9663 2.4683 10.2748 28.9379 51.9960 1.1751 5.5907 9.6162 27.2030 13.8499 17.3563 54.5689 2.7305 10.5702 126.1824 100.8943 96.6724 53.4434 296.1140 67.7581 24.2971 29.7348 12.5586 25.1437 45.1829 33.0004 29.6533 8.3227 30.4192 70.0505 70.2522 2.5551 9.8835 47.6050 4.5495 107.8663 3.9981 29.6118 11.0229 30.8063 17.6747 5.2880 4.3314 12.6155 4.6245 1.7095
temp: 298.150 k
press: 1.00000 atm
elementType: 8 8 8 7 7 7 6 6 6 6 6 6 6 6 6 6 6 6 6 6 6 6 6 6 6 6 1 1 1 1 1 1 1 1 1 1 1 1 1 1 1 1 1 1 1 1 1 1 1 1 1 1 1
symmnumber: 1
zpe: 1164782.7 jmol-1
zpe.correction: 0.443642 hartree
zpe.thermalcorrener: 0.468442 hartree
zpe.thermalcorrenthalpy: 0.469387 hartree
zpe.thermalcorrgfe: 0.385808 hartree
zpe.sumelectzpe: -1166.286329 hartree
zpe.sumelectthermal: -1166.261528 hartree
zpe.sumelectthermalent: -1166.260584 hartree
zpe.sumelectthermalfe: -1166.344162 hartree
dipole: -1.6593 -4.3060 -0.5622
dipole: 4.6488
quadrupole: -132.2744 -155.1130 -166.5617
quadrupole: 11.3070 -21.3619 5.3726
quadrupole: 19.0419 -3.7966 -15.2453 11.3070 -21.3619 5.3726
hfenergy: -1166.7299708 hartree
pointgroup: C01 [X(C20H27N3O3)]
dipole: -0.5247652 -1.050824 1.4019596 debye
polarizability: 316.012692|12.2576773|188.0007146|-22.0303183|2.8568162|224.778676 unknown
InChI: InChI=1S/C20H27N3O3/c1-13(24)23-19(14-8-10-16(26-2)11-9-14)17-12-22(20(25)18(17)21-23)15-6-4-3-5-7-15/h8-11,15,17-19,21H,3-7,12H2,1-2H3
charge 0 multiplicity 1
53 atoms
O  2.282906 2.055592 1.687817
O  -0.573173 0.350738 -3.143036
O  -6.709942 -1.110675 0.661535
N  2.292803 -0.084606 0.688717
N  -0.806293 0.895094 -0.910015
N  -0.514662 1.727962 0.223816
C  -0.054728 -0.647969 0.696694
C  0.160523 0.818161 1.21725
C  1.352315 -1.11103 0.200167
C  -1.083001 -0.511708 -0.462264
C  3.753619 -0.149953 0.464836
C  1.687881 1.033844 1.240621
C  4.372626 -1.46285 1.003065
C  4.111666 0.066387 -1.029869
C  -2.549243 -0.694654 -0.084934
C  5.908232 -1.463739 0.802027
C  5.646396 0.058829 -1.230459
C  6.280776 -1.24231 -0.68365
C  -0.443699 1.216853 -2.220563
C  -3.479087 -1.041444 -1.104327
C  -3.043673 -0.479322 1.222773
C  0.039195 2.636651 -2.461092
C  -4.848802 -1.17235 -0.826245
C  -4.421082 -0.603635 1.522685
C  -5.326776 -0.952609 0.491876
C  -7.258314 -0.890151 2.001924
H  -0.421324 -1.317055 1.490159
H  -0.246522 1.014906 2.223869
H  1.614221 -2.106485 0.602156
H  1.382797 -1.173859 -0.905621
H  -0.838991 -1.163945 -1.317731
H  4.164751 0.701616 1.043772
H  -1.400011 2.097036 0.609188
H  3.94312 -2.331887 0.462546
H  4.119972 -1.581513 2.074204
H  3.679299 1.02429 -1.375173
H  3.660357 -0.74029 -1.643471
H  6.332895 -2.41844 1.167529
H  6.35814 -0.656675 1.415795
H  6.08681 0.92994 -0.703192
H  5.884713 0.18149 -2.30426
H  7.381143 -1.208042 -0.798974
H  5.921241 -2.10449 -1.28298
H  -3.115326 -1.195964 -2.127075
H  -2.357001 -0.224455 2.039024
H  -0.826676 3.306224 -2.619972
H  0.650617 2.646145 -3.376514
H  0.6043 3.021927 -1.597672
H  -5.56764 -1.442193 -1.605685
H  -4.767562 -0.434465 2.54656
H  -6.834032 -1.605244 2.733603
H  -8.33994 -1.061347 1.90131
H  -7.075114 0.14637 2.346359
