program: Gaussian 09
title: 000289941
version: EM64L-G09RevD.01
frameworkgroup: C1[X(C19H25N3O2)]
method: RPBEPBE
basis: SDD
operation: Freq
keyword: #p
keyword: freq=noraman
keyword: PBEPBE/SDD
title: #p freq=noraman PBEPBE/SDD
converged: YES YES NO NO
title: Mulliken charges:
elementType: O O N N N C C C C C C C C C C C C C C C C C C C H H H H H H H H H H H H H H H H H H H H H H H H H
charge: -0.252699 -0.292511 -0.166130 -0.158276 -0.241954 -0.269968 -0.342529 -0.424198 -0.312610 0.027510 0.179850 -0.434821 -0.432413 -0.392254 -0.395503 0.518010 -0.392762 0.250763 -0.410069 -0.386827 -0.765359 -0.234218 -0.255468 -0.236335 0.284572 0.264943 0.228759 0.249614 0.288116 0.249224 0.295815 0.187704 0.217924 0.219655 0.195285 0.201090 0.202324 0.201561 0.203402 0.204322 0.190002 0.259608 0.235585 0.238389 0.242080 0.271725 0.229932 0.227080 0.232059
chargesum: 0.00000
title: Mulliken charges with hydrogens summed into heavy atoms:
elementType: O O N N N C C C C C C C C C C C C C C C C C C C
charge: -0.252699 -0.292511 -0.166130 -0.158276 0.053862 0.014604 -0.077586 0.054175 -0.024494 0.276733 0.179850 -0.029193 -0.017473 0.011160 0.009460 0.518010 0.001562 0.250763 -0.150461 -0.151242 -0.013165 -0.004286 -0.028388 -0.004276
polarizability: 2.75878411e+02 1.51884205e+01 1.98811541e+02 6.10127024e+00 -1.74088257e+01 1.91682531e+02
1716.lowfreq: -8.0168 -0.0009 -0.0007 -0.0004 4.3318 5.4126 19.9163 23.4656 30.3514
frequency: 18.9030 22.9296 30.3294 39.6572 45.5763 60.4905 77.4035 91.6232 100.0514 106.8723 140.8876 177.4678 203.7559 216.1666 223.3799 228.1497 277.3623 279.3704 320.8841 322.5227 341.8471 381.4239 403.7650 429.4736 432.9035 447.6664 482.1169 489.4082 525.6155 546.9249 554.6224 598.8652 609.5137 618.0671 635.8909 678.1523 691.7142 707.1884 740.4869 754.0083 772.7474 787.0637 794.9934 819.5760 842.1615 846.0395 855.3071 868.8091 876.3675 887.8735 895.2221 919.2753 927.0924 948.0447 962.6302 978.1938 981.8008 991.5829 999.1613 1000.9447 1028.6512 1035.3250 1039.7182 1043.9639 1046.8532 1058.4226 1064.1706 1071.7991 1076.1278 1093.0753 1111.4286 1112.7550 1149.8368 1173.6912 1179.7689 1191.3631 1191.6954 1192.5447 1206.9136 1218.2922 1238.0327 1245.4018 1254.4993 1257.3859 1260.8445 1276.7108 1292.3314 1309.0793 1310.0858 1315.8455 1331.1831 1335.2997 1340.6910 1342.5396 1345.0694 1354.2942 1362.9330 1365.6321 1379.3679 1389.2546 1415.8342 1442.7968 1445.7778 1449.5446 1460.8157 1463.8922 1464.3343 1465.0385 1471.8742 1479.3855 1484.1502 1498.1834 1582.9698 1593.0124 1613.1771 1638.4534 2962.2021 2966.0426 2967.9224 2973.3584 2973.9263 2979.8526 2996.9569 2998.8574 3029.1657 3031.9679 3032.7104 3038.8402 3040.0402 3047.7776 3049.6438 3055.3801 3078.0350 3089.4828 3118.5116 3125.5491 3133.5361 3136.4000 3147.0744 3164.6443 3366.5658
redmass: 3.0289 4.9414 4.3799 5.0325 4.7275 5.2324 3.1189 1.3148 4.6368 2.6697 3.4385 3.2364 4.4185 3.8922 2.2798 3.4217 5.1086 4.8250 2.9618 3.0571 2.1653 4.6674 2.8265 3.7823 2.9437 3.5598 3.1912 2.0408 3.5047 4.8236 3.1408 4.4942 4.8929 5.9357 5.3958 3.9936 5.2194 1.7579 3.7752 2.2043 2.3745 1.4434 2.6227 3.2962 3.4235 2.3190 1.2491 3.6318 1.8372 2.5316 1.5329 1.8398 1.5112 2.7425 2.7318 1.4819 2.0978 4.3282 1.4428 2.2038 2.1686 2.2791 1.7674 1.9044 1.8178 1.1849 2.6315 1.4626 1.9931 1.7874 3.0986 3.4624 2.4966 1.0747 1.5094 1.5667 1.8821 1.2281 1.8473 1.5314 1.6789 1.5902 1.4751 1.3252 1.2717 1.6383 1.4071 1.3380 1.4786 1.4969 1.3663 1.3595 1.4542 1.5059 1.3602 1.7469 1.8589 1.7769 1.2883 3.4001 2.0707 1.1762 2.0256 1.1440 1.0898 1.2066 1.0944 1.0899 1.0816 1.0994 2.2714 1.0944 7.1302 5.9894 6.0323 10.8004 1.0642 1.0639 1.0640 1.0624 1.0619 1.0603 1.0809 1.0378 1.1028 1.0967 1.0959 1.0990 1.1026 1.0865 1.1031 1.0857 1.0882 1.0943 1.0857 1.0871 1.1021 1.0916 1.0961 1.1014 1.0764
irintensity: 0.2502 0.5451 1.3956 0.6950 0.8087 3.6903 1.8828 1.3665 1.6063 5.8131 0.7898 1.2885 0.3229 5.3351 3.6678 7.9565 0.4569 0.7418 5.1286 6.0229 3.8121 3.1178 0.1201 2.0107 6.1770 1.2727 4.1352 6.4240 15.5593 1.5501 0.2501 10.2514 22.9792 8.6800 4.6722 5.9671 19.2280 44.3812 54.4252 53.7918 13.2063 0.3808 6.1055 2.7449 10.1516 5.2545 0.3781 15.4626 5.3298 1.0186 15.9771 0.3044 2.8017 3.6680 8.7428 1.2815 6.7403 2.8015 4.1008 15.8855 3.9647 3.9297 8.1713 2.0492 0.8629 0.4431 1.3418 1.0076 3.8013 10.4951 9.4255 11.4450 1.6753 0.1402 5.8452 4.2502 8.2418 7.6706 4.4794 2.4022 31.8073 83.3167 12.9599 7.1789 2.9585 60.4400 27.2001 0.6495 53.5835 11.1981 9.7447 1.0133 0.3279 4.3693 0.3238 34.6803 34.0789 22.9075 75.8921 2.5145 36.9352 26.6071 6.9063 52.8376 1.2223 21.5077 6.0897 10.1205 19.0531 3.1808 18.5799 12.7887 173.9184 5.7975 9.0568 299.7758 20.6420 19.5123 30.5267 32.0281 31.3084 38.2159 30.9462 7.5896 20.8031 81.3801 68.7138 2.0326 0.4553 8.0596 109.0378 4.2362 26.8308 10.1428 11.7229 0.0762 6.3879 14.1875 30.4035 25.1117 1.4471
temp: 298.150 k
press: 1.00000 atm
elementType: 8 8 7 7 7 6 6 6 6 6 6 6 6 6 6 6 6 6 6 6 6 6 6 6 1 1 1 1 1 1 1 1 1 1 1 1 1 1 1 1 1 1 1 1 1 1 1 1 1
symmnumber: 1
zpe: 1083068.3 jmol-1
zpe.correction: 0.412519 hartree
zpe.thermalcorrener: 0.434534 hartree
zpe.thermalcorrenthalpy: 0.435478 hartree
zpe.thermalcorrgfe: 0.358546 hartree
zpe.sumelectzpe: -1051.934462 hartree
zpe.sumelectthermal: -1051.912447 hartree
zpe.sumelectthermalent: -1051.911503 hartree
zpe.sumelectthermalfe: -1051.988436 hartree
dipole: -0.6040 -3.3241 -1.5575
dipole: 3.7203
quadrupole: -125.4244 -144.7737 -154.0546
quadrupole: 5.9387 -12.9489 4.3620
quadrupole: 15.9932 -3.3562 -12.6370 5.9387 -12.9489 4.3620
hfenergy: -1052.3469814 hartree
pointgroup: C01 [X(C19H25N3O2)]
dipole: -0.0368989 -1.1823219 0.8620283 debye
polarizability: 269.6857926|23.6049281|182.8080457|-15.6195695|3.4256907|213.878644 unknown
InChI: InChI=1S/C19H25N3O2/c1-13(23)22-18(14-8-4-2-5-9-14)16-12-21(19(24)17(16)20-22)15-10-6-3-7-11-15/h2,4-5,8-9,15-18,20H,3,6-7,10-12H2,1H3
charge 0 multiplicity 1
49 atoms
O  1.6289 2.306921 1.49705
O  -1.592006 0.023057 -2.888541
N  1.821738 0.159667 0.531706
N  -1.580434 0.615436 -0.655599
N  -1.261331 1.529017 0.40611
C  -0.395527 -0.734564 0.863534
C  -0.334927 0.768301 1.317126
C  0.988546 -1.008955 0.192397
C  -1.574252 -0.797293 -0.148733
C  3.260279 0.25484 0.203941
C  1.135774 1.19942 1.139443
C  4.107645 -0.75313 1.023014
C  3.525119 0.101162 -1.315712
C  5.613818 -0.584703 0.707158
C  5.031741 0.2731 -1.625959
C  -2.93605 -1.179083 0.427109
C  5.892689 -0.719976 -0.809029
C  -1.464449 0.934783 -2.011428
C  -3.905262 -1.749066 -0.438838
C  -3.290231 -0.933217 1.778776
C  -1.24272 2.400197 -2.342636
C  -5.195346 -2.06984 0.034349
C  -4.583277 -1.250725 2.254549
C  -5.539539 -1.820825 1.384459
H  -0.551874 -1.414429 1.715038
H  -0.632345 0.944074 2.36526
H  1.446501 -1.940867 0.571649
H  0.88326 -1.106702 -0.905767
H  -1.349492 -1.440353 -1.016254
H  3.547469 1.281248 0.510129
H  -2.12969 1.790467 0.902285
H  3.799944 -1.790784 0.776095
H  3.918828 -0.600166 2.102411
H  2.92528 0.844948 -1.873793
H  3.201573 -0.904768 -1.655076
H  6.20204 -1.330917 1.274982
H  5.947743 0.415548 1.051567
H  5.339468 1.310572 -1.381897
H  5.20824 0.134153 -2.709707
H  6.967122 -0.551331 -1.014898
H  5.662338 -1.756278 -1.133303
H  -3.643192 -1.92506 -1.48907
H  -2.557722 -0.505869 2.474303
H  -2.205789 2.943297 -2.319175
H  -0.832272 2.468798 -3.361534
H  -0.575396 2.88079 -1.609369
H  -5.931282 -2.512693 -0.645903
H  -4.842058 -1.057566 3.301798
H  -6.54049 -2.070534 1.753483
