program: Gaussian 09
title: 000289939
version: EM64L-G09RevD.01
frameworkgroup: C1[X(C18H24ClN3O2)]
method: RPBEPBE
basis: SDD
operation: Freq
keyword: #p
keyword: freq=noraman
keyword: PBEPBE/SDD
title: #p freq=noraman PBEPBE/SDD
converged: YES YES NO NO
title: Mulliken charges:
elementType: Cl O O N N N C C C C C C C C C C C C C C C C C C H H H H H H H H H H H H H H H H H H H H H H H H
charge: -0.066803 -0.460421 -0.279041 -0.157242 -0.137144 -0.274276 -0.250058 0.049463 -0.424022 -0.429474 0.018349 0.170710 -0.430924 -0.433282 0.600480 -0.393649 -0.394571 -0.392781 -0.600124 -0.439730 -0.390466 -0.221067 -0.242871 -0.104742 0.306222 0.234627 0.227304 0.237339 0.246979 0.282101 0.185510 0.223222 0.219845 0.191898 0.203688 0.202905 0.202799 0.202897 0.206095 0.189837 0.375327 0.234836 0.227698 0.226801 0.228212 0.320806 0.252993 0.253746
chargesum: 0.00000
title: Mulliken charges with hydrogens summed into heavy atoms:
elementType: Cl O O N N N C C C C C C C C C C C C C C C C C C
charge: -0.066803 -0.085094 -0.279041 -0.157242 -0.137144 0.007825 0.056164 0.049463 0.037909 -0.192135 0.265328 0.170710 -0.022192 -0.021539 0.600480 0.012945 0.011125 0.003150 0.089210 -0.211518 -0.069660 0.031926 0.010875 -0.104742
polarizability: 3.11068819e+02 -5.41362610e+00 1.92688742e+02 -9.32397028e+00 -1.92169692e+01 1.77978021e+02
1716.lowfreq: -29.4969 -16.6284 -8.2931 -1.8085 -0.0010 0.0003 0.0013 17.6105 24.5397
frequency: -26.9239 16.6008 21.2857 43.2538 51.9095 70.7255 79.4949 115.9607 130.6490 149.1357 184.1269 185.9484 198.3100 211.5596 218.6202 230.6212 260.8224 281.1743 283.1905 314.7617 325.3139 354.1340 362.0657 387.5222 408.8724 412.0703 428.4134 440.7182 446.2166 474.0620 486.2821 502.4839 530.7776 583.8794 622.8830 649.4097 651.1031 666.9349 684.2028 720.5784 725.3016 735.2754 774.4320 785.6360 786.1653 795.6716 830.9224 839.1289 850.7046 869.1009 885.0532 894.1727 916.0189 919.7173 949.5836 968.4096 979.9348 990.2187 994.0703 1001.5245 1005.7652 1029.9391 1042.9614 1045.5547 1054.5695 1061.2883 1072.7909 1075.0415 1091.9682 1108.7588 1110.4235 1119.5643 1142.6738 1154.4292 1180.6500 1190.2366 1191.1641 1196.0763 1204.3988 1219.0868 1237.5308 1242.7314 1252.4262 1255.8665 1258.1412 1269.2754 1297.4969 1306.5502 1307.9790 1324.0562 1331.9670 1332.9784 1335.9953 1338.9812 1343.5547 1357.4021 1363.1100 1382.8660 1409.9612 1414.4234 1420.3860 1426.8011 1460.3670 1460.5916 1460.9192 1464.6712 1469.9411 1476.6857 1480.6080 1484.8408 1488.7055 1587.2772 1602.2275 1633.0623 2958.3958 2964.6626 2965.9102 2966.3311 2968.2040 2973.4057 2973.8181 2995.6450 3002.2149 3032.5871 3033.5590 3038.5810 3040.5329 3042.0642 3050.4585 3066.2784 3084.8026 3102.5207 3120.9485 3135.5164 3164.7166 3168.5885 3358.7287 3443.9524
redmass: 3.0970 5.4376 3.9354 4.3910 4.1471 5.2131 5.2245 6.2181 4.9864 3.8300 3.1675 1.1061 5.3488 1.9370 3.9797 5.4941 3.3610 4.8741 4.7909 5.3974 1.8886 4.2256 5.2719 4.4504 2.9474 4.1283 2.6743 4.4088 3.8011 3.4010 1.8473 1.1188 3.3671 5.4592 6.9953 4.8348 4.5831 3.7010 7.6943 5.1387 4.0056 3.4284 2.6523 2.1786 1.7460 3.1554 1.4916 2.2886 1.4944 1.9314 2.4284 1.5584 2.5714 2.0097 1.4629 2.2392 2.1816 2.7011 1.3771 3.8577 3.9032 2.7043 2.9354 1.8210 1.1634 2.3242 1.4334 2.6027 3.2060 1.4199 2.4490 1.4264 2.4925 1.8944 2.0573 1.8678 1.6301 1.2891 1.5103 2.9676 1.6168 1.7352 1.4690 1.2928 1.2842 1.4735 1.4629 1.3141 1.3607 1.3540 1.7767 1.3803 1.4466 1.4545 1.4568 1.6318 1.7175 4.3820 1.9174 2.1574 1.2515 1.1873 1.0834 1.0527 1.0900 1.0878 1.0827 1.1000 1.0755 2.1364 1.1205 7.0272 5.6252 10.4445 1.0653 1.0637 1.0390 1.0643 1.0661 1.0615 1.0624 1.0811 1.0854 1.0968 1.0955 1.1001 1.0983 1.0996 1.1027 1.0950 1.0880 1.1011 1.0898 1.0920 1.0949 1.0956 1.0764 1.0650
irintensity: 0.0387 0.3216 0.2624 0.0616 3.1766 1.0593 2.0650 0.3504 0.5831 0.1079 0.9687 0.4963 4.3275 0.1697 2.2747 6.4295 4.3326 9.2449 18.4209 2.0901 0.8747 13.8815 0.6172 15.3889 0.4635 13.4412 3.1620 16.4629 3.1354 13.0028 2.1634 98.6663 29.5790 5.8812 0.1163 6.1404 24.7046 4.2112 16.1554 0.9081 0.7408 58.6393 27.8131 16.9682 4.0039 14.5947 15.5704 3.4740 33.0310 14.9104 8.7181 15.4726 1.2479 0.7127 7.7158 53.7918 47.2773 46.1558 3.9182 23.4423 37.4929 1.8941 0.4393 0.7072 0.2794 8.7020 3.1353 43.0222 19.4263 30.1365 0.2771 6.4558 17.2913 19.1592 22.1566 9.9101 5.8867 1.1482 3.2892 43.4018 22.8353 70.0411 11.2972 11.5866 4.2279 119.0646 2.2669 0.3545 4.6216 15.5226 2.5542 0.6319 0.4565 0.3295 1.8126 16.7705 9.3379 1.7768 7.0390 59.3220 4.9370 14.4106 6.6541 9.7525 2.6769 9.9195 20.3991 3.3444 6.3412 72.4316 24.4005 3.9595 6.6607 269.9389 11.6257 30.9594 70.7181 19.1205 46.0854 25.7539 34.8253 27.7817 28.3659 73.8428 69.5915 1.2548 20.5454 6.6947 102.6669 33.5243 8.2207 19.6958 12.6274 20.0806 4.5999 6.8661 10.0623 35.7097
temp: 298.150 k
press: 1.00000 atm
elementType: 17 8 8 7 7 7 6 6 6 6 6 6 6 6 6 6 6 6 6 6 6 6 6 6 1 1 1 1 1 1 1 1 1 1 1 1 1 1 1 1 1 1 1 1 1 1 1 1
symmnumber: 1
zpe: 1040196.4 jmol-1
zpe.correction: 0.396190 hartree
zpe.thermalcorrener: 0.417874 hartree
zpe.thermalcorrenthalpy: 0.418819 hartree
zpe.thermalcorrgfe: 0.344119 hartree
zpe.sumelectzpe: -1473.245970 hartree
zpe.sumelectthermal: -1473.224285 hartree
zpe.sumelectthermalent: -1473.223341 hartree
zpe.sumelectthermalfe: -1473.298040 hartree
dipole: -4.5372 -3.7380 1.6531
dipole: 6.1067
quadrupole: -162.7555 -149.5562 -147.5344
quadrupole: 10.3070 -0.0973 -3.8303
quadrupole: -9.4735 3.7258 5.7477 10.3070 -0.0973 -3.8303
hfenergy: -1473.6421596 hartree
pointgroup: C01 [X(C18H24Cl1N3O2)]
dipole: 1.5437957 -1.6985061 -0.7100085 debye
polarizability: 308.7333818|-7.5064806|194.672959|-17.2580955|20.2045823|178.3292416 unknown
InChI: InChI=1S/C18H24ClN3O2/c1-21-18(24)15(16(20-21)12-7-9-13(19)10-8-12)11-22(17(18)23)14-5-3-2-4-6-14/h7-10,14-16,20,24H,2-6,11H2,1H3
charge 0 multiplicity 1
48 atoms
Cl -7.356891 0.088174 1.509336
O  -0.517821 1.972783 1.492787
O  2.250293 2.162487 0.855087
N  1.974106 -0.110463 0.217444
N  -0.402821 1.712306 -0.964267
N  -1.256731 0.721849 -1.642068
C  -0.42744 -0.286709 0.380914
C  0.008146 1.200653 0.375172
C  0.860747 -1.04448 -0.071648
C  -1.589163 -0.372373 -0.651347
C  3.40363 -0.484609 0.166224
C  1.546288 1.165366 0.505044
C  3.776265 -1.501864 1.275135
C  3.81597 -1.007421 -1.233131
C  -2.997504 -0.245523 -0.07328
C  5.289609 -1.825592 1.233192
C  5.329147 -1.332607 -1.271529
C  5.720181 -2.338127 -0.161959
C  -0.933201 3.090229 -1.031961
C  -4.035864 -1.034673 -0.629099
C  -3.316225 0.650684 0.980489
C  -5.364573 -0.943258 -0.159362
C  -4.640132 0.757436 1.461559
C  -5.644527 -0.041865 0.884165
H  -0.71997 -0.583582 1.399391
H  0.993208 -1.992215 0.479434
H  0.822893 -1.278612 -1.155273
H  -1.541106 -1.33144 -1.203059
H  3.948679 0.460294 0.365454
H  -0.697027 0.323682 -2.414875
H  3.202144 -2.440815 1.131557
H  3.494291 -1.08975 2.262171
H  3.561589 -0.251697 -2.000397
H  3.242968 -1.927923 -1.471613
H  5.533705 -2.574284 2.010828
H  5.864808 -0.909801 1.480141
H  5.906862 -0.395464 -1.135606
H  5.600774 -1.732995 -2.266988
H  6.811826 -2.51951 -0.180649
H  5.229352 -3.31344 -0.361619
H  0.195006 2.623909 1.746422
H  -1.910631 3.210015 -0.524862
H  -1.042914 3.367642 -2.092638
H  -0.197754 3.771581 -0.570227
H  -3.810987 -1.730937 -1.446629
H  -2.535749 1.273759 1.430416
H  -6.159392 -1.557465 -0.592175
H  -4.883162 1.450045 2.272803
