program: Gaussian 09
title: 000289936
version: EM64L-G09RevD.01
frameworkgroup: C1[X(C18H24ClN3O2)]
method: RPBEPBE
basis: SDD
operation: Freq
keyword: #p
keyword: freq=noraman
keyword: PBEPBE/SDD
title: #p freq=noraman PBEPBE/SDD
converged: YES YES NO NO
title: Mulliken charges:
elementType: Cl O O N N N C C C C C C C C C C C C C C C C C C H H H H H H H H H H H H H H H H H H H H H H H H
charge: -0.065748 -0.454766 -0.273346 -0.165965 -0.089445 -0.283618 -0.236755 -0.050809 -0.443570 -0.358466 0.029993 0.171257 -0.436419 -0.434210 0.591999 -0.394635 -0.395139 -0.394047 -0.614717 -0.442406 -0.393280 -0.218536 -0.242997 -0.104508 0.298069 0.240682 0.232212 0.229478 0.247625 0.313638 0.188852 0.221280 0.219182 0.190283 0.203827 0.203629 0.203948 0.203508 0.206399 0.190439 0.380713 0.214399 0.204208 0.255096 0.228046 0.317466 0.253012 0.254141
chargesum: 0.00000
title: Mulliken charges with hydrogens summed into heavy atoms:
elementType: Cl O O N N N C C C C C C C C C C C C C C C C C C
charge: -0.065748 -0.074052 -0.273346 -0.165965 -0.089445 0.030020 0.061315 -0.050809 0.029324 -0.128988 0.277618 0.171257 -0.026288 -0.024745 0.591999 0.012822 0.012318 0.002791 0.058986 -0.214359 -0.075814 0.034476 0.011144 -0.104508
polarizability: 3.15236205e+02 3.48214438e+00 2.06252416e+02 -1.12581807e+01 -1.57931475e+00 1.61441402e+02
1716.lowfreq: -14.1972 -7.6698 -0.0020 -0.0013 0.0011 5.3983 11.0487 21.3844 32.9146
frequency: 8.8697 21.0908 32.8628 47.6217 58.9064 68.9834 81.2369 113.5801 136.2756 159.5311 173.2525 192.2538 206.0285 214.3051 222.1895 225.6776 275.6356 276.1446 291.5001 320.0554 327.8346 329.7980 373.1980 390.0213 411.1291 412.9025 433.3026 445.3004 449.6868 472.8334 489.2990 499.2011 523.8782 589.2128 623.2398 640.5513 662.4820 671.0137 689.4718 696.6024 722.3386 728.2569 773.6258 782.4911 793.5619 804.4323 835.9675 840.2981 843.9146 856.7193 876.8492 894.3749 911.6588 916.7670 951.1190 960.5307 961.7785 989.8989 992.5131 999.6625 1012.1478 1028.3953 1038.4755 1045.7300 1053.6448 1056.1867 1072.1220 1074.7931 1099.5370 1109.7474 1111.0901 1119.5814 1134.5926 1160.2397 1165.1975 1185.2171 1189.7752 1192.9306 1196.2960 1203.1622 1226.6890 1241.8633 1253.6967 1256.3298 1258.6498 1266.5946 1293.0596 1305.3048 1307.1022 1324.2749 1329.1992 1333.9626 1339.9864 1341.0245 1343.2581 1351.5154 1366.3481 1380.5894 1392.9803 1406.9194 1419.5344 1423.9686 1454.7873 1457.2490 1462.0562 1462.8646 1470.2791 1477.1758 1479.1459 1483.0178 1502.4168 1587.2779 1600.5895 1635.2049 2912.1118 2963.0057 2966.2967 2967.9289 2974.4131 2974.5626 2988.9665 2997.8647 3020.1315 3032.2578 3033.1265 3036.3734 3038.7587 3040.8625 3045.6394 3050.1639 3082.9024 3104.6895 3123.3036 3136.9205 3166.2451 3169.3294 3408.5451 3435.2204
redmass: 3.6057 4.0181 5.1454 4.1485 6.6272 4.1540 4.4379 4.5499 5.1586 2.4683 2.0942 4.0418 2.6187 1.8451 5.5535 2.2611 4.8008 4.1988 6.0847 4.0233 2.9956 2.4219 4.8574 4.0736 3.1811 4.3757 2.6179 3.6915 3.6685 2.2322 1.7114 1.3706 3.3025 5.1696 6.8030 3.6732 3.5704 4.9124 4.8285 5.3053 4.3205 4.8986 2.9042 1.4773 2.6164 2.5380 1.4458 3.2213 2.2820 1.8354 1.7835 1.5148 2.5534 1.8877 1.5333 2.5903 2.6279 1.3646 2.4023 4.3440 4.8153 3.1824 2.6187 1.8328 2.0342 1.1386 1.4252 2.6347 3.4899 2.4139 1.4002 1.4184 2.6412 2.4218 2.1258 2.1296 1.4947 1.2812 1.4790 1.6236 1.7963 1.6150 1.4474 1.2989 1.2892 1.4464 1.5603 1.3707 1.3136 1.5412 1.5649 1.3542 1.4359 1.4709 1.4422 1.4944 1.7157 5.1327 1.3152 2.1123 1.4692 1.5637 1.0543 1.0906 1.0890 1.0929 1.0818 1.0940 1.0806 2.3326 1.0834 7.0345 5.8265 10.2289 1.0496 1.0632 1.0639 1.0647 1.0621 1.0623 1.0586 1.0814 1.0860 1.0966 1.0960 1.1033 1.0995 1.1024 1.0818 1.1033 1.0877 1.1000 1.0897 1.0915 1.0949 1.0959 1.0756 1.0650
irintensity: 0.3828 0.0661 0.3377 1.2796 1.1867 1.2515 1.2556 0.2587 0.3285 0.3029 0.6660 3.3950 3.1650 0.0958 5.4080 2.1365 0.2880 3.3782 14.3142 4.1303 3.2203 0.8966 10.5545 5.7707 3.6467 16.3404 0.7054 2.5523 30.4795 17.9656 3.7089 67.3401 18.1775 3.8532 2.1012 74.6916 85.6181 9.4753 21.5291 5.9577 4.2367 4.2571 11.2578 0.3946 28.4869 13.2591 4.4233 11.5070 12.0362 32.4530 1.8546 16.9841 5.8996 0.4839 2.4968 14.1752 15.5237 4.1663 56.8675 36.6119 51.0139 16.9730 2.1715 0.9669 15.5790 0.6067 3.3584 45.5433 16.2220 0.1150 3.7073 13.4374 7.0628 1.5381 9.9960 15.4116 2.8040 1.6943 2.2296 15.0625 26.2872 119.0190 11.8530 6.7478 6.6502 91.4615 0.9843 4.2604 0.5783 23.3354 1.7131 0.3315 0.3131 1.6000 4.6839 33.6111 11.2175 1.0051 3.6532 11.9971 17.7429 17.6396 9.9574 2.8075 8.7402 6.3799 20.6294 9.5170 1.8565 86.5371 16.4158 3.5189 6.3017 281.2662 104.1120 19.3360 27.6177 31.1758 28.5610 32.4466 33.7286 27.8046 24.3609 80.2154 69.7834 22.0243 5.0161 3.0832 38.3815 106.0135 9.2743 16.0401 12.3154 7.2026 4.0618 5.2380 4.6153 41.7755
temp: 298.150 k
press: 1.00000 atm
elementType: 17 8 8 7 7 7 6 6 6 6 6 6 6 6 6 6 6 6 6 6 6 6 6 6 1 1 1 1 1 1 1 1 1 1 1 1 1 1 1 1 1 1 1 1 1 1 1 1
symmnumber: 1
zpe: 1039836.7 jmol-1
zpe.correction: 0.396053 hartree
zpe.thermalcorrener: 0.418561 hartree
zpe.thermalcorrenthalpy: 0.419505 hartree
zpe.thermalcorrgfe: 0.341891 hartree
zpe.sumelectzpe: -1473.247575 hartree
zpe.sumelectthermal: -1473.225067 hartree
zpe.sumelectthermalent: -1473.224123 hartree
zpe.sumelectthermalfe: -1473.301737 hartree
dipole: -4.2303 -4.0610 -1.9840
dipole: 6.1906
quadrupole: -161.9082 -146.2331 -153.8388
quadrupole: 6.8702 7.5453 -3.6287
quadrupole: -7.9148 7.7603 0.1546 6.8702 7.5453 -3.6287
hfenergy: -1473.6436278 hartree
pointgroup: C01 [X(C18H24Cl1N3O2)]
dipole: 1.4294282 -1.850146 -0.6824631 debye
polarizability: 311.1998086|-4.2362619|184.2960214|-23.7556402|24.0157129|187.4341927 unknown
InChI: InChI=1S/C18H24ClN3O2/c1-21-16(12-7-9-13(19)10-8-12)15-11-22(14-5-3-2-4-6-14)17(23)18(15,24)20-21/h7-10,14-16,20,24H,2-6,11H2,1H3
charge 0 multiplicity 1
48 atoms
Cl -7.412524 0.120655 1.683345
O  -0.49838 2.092475 1.752182
O  2.185911 2.342569 0.832587
N  1.89439 0.060828 0.248581
N  -1.373681 0.93441 -1.423627
N  -0.677933 1.949877 -0.651087
C  -0.497256 -0.154462 0.565753
C  -0.07286 1.3441 0.58051
C  0.798937 -0.931459 0.160729
C  -1.642575 -0.232499 -0.489436
C  3.323143 -0.270841 0.054094
C  1.46886 1.332787 0.556163
C  3.834671 -1.306255 1.087159
C  3.61253 -0.739473 -1.39464
C  -3.051917 -0.151629 0.093902
C  5.349758 -1.559528 0.891905
C  5.126832 -0.995591 -1.589964
C  5.66553 -2.011441 -0.554146
C  -0.637967 0.596241 -2.66774
C  -4.086217 -0.929407 -0.4845
C  -3.374703 0.713745 1.172376
C  -5.415061 -0.85675 -0.011839
C  -4.699546 0.803424 1.655584
C  -5.699406 0.015669 1.055407
H  -0.829281 -0.455983 1.570639
H  0.993702 -1.77573 0.846892
H  0.722525 -1.340997 -0.863936
H  -1.566124 -1.162745 -1.08199
H  3.856597 0.685538 0.227928
H  -1.333599 2.69252 -0.36215
H  3.290558 -2.265274 0.961598
H  3.630354 -0.940774 2.111282
H  3.25186 0.0246 -2.109423
H  3.057463 -1.678074 -1.60279
H  5.699025 -2.319084 1.617132
H  5.906263 -0.626041 1.113753
H  5.674912 -0.037207 -1.482932
H  5.316291 -1.35776 -2.618545
H  6.757149 -2.142019 -0.681941
H  5.200552 -3.002415 -0.737619
H  0.239306 2.732488 1.962276
H  -1.229014 -0.144162 -3.235587
H  0.389275 0.198027 -2.503488
H  -0.551356 1.510677 -3.275369
H  -3.857582 -1.601657 -1.320744
H  -2.597752 1.323464 1.646589
H  -6.207086 -1.463172 -0.460427
H  -4.945776 1.472136 2.485551
