program: Gaussian 09
title: 000289930
version: EM64L-G09RevD.01
frameworkgroup: C1[X(C17H23N3O2)]
method: RPBEPBE
basis: SDD
operation: Freq
keyword: #p
keyword: freq=noraman
keyword: PBEPBE/SDD
title: #p freq=noraman PBEPBE/SDD
converged: YES YES NO NO
title: Mulliken charges:
elementType: O O N N N C C C C C C C C C C C C C C C C C H H H H H H H H H H H H H H H H H H H H H H H
charge: -0.456658 -0.276265 -0.158644 -0.303942 -0.286816 -0.237708 -0.031664 -0.430710 -0.418055 0.020042 0.167628 -0.430488 -0.435234 -0.393577 -0.394777 0.566930 -0.392795 -0.438424 -0.405150 -0.233170 -0.256683 -0.240713 0.301203 0.235270 0.228213 0.234787 0.248584 0.312525 0.185999 0.224846 0.218337 0.193667 0.282341 0.203613 0.203343 0.202917 0.202956 0.206072 0.189674 0.379799 0.222299 0.314346 0.223800 0.225027 0.227253
chargesum: 0.00000
title: Mulliken charges with hydrogens summed into heavy atoms:
elementType: O O N N N C C C C C C C C C C C C C C C C C
charge: -0.076858 -0.276265 -0.158644 0.008583 -0.004475 0.063496 -0.031664 0.032773 -0.183268 0.268626 0.167628 -0.019642 -0.023230 0.013379 0.011096 0.566930 0.002950 -0.216125 -0.090804 -0.009369 -0.031656 -0.013460
polarizability: 2.68077610e+02 -2.99411722e+00 1.92497596e+02 -1.03330421e+01 -1.07525716e+01 1.47063677e+02
1716.lowfreq: -22.8869 -5.5587 -0.0010 -0.0008 0.0005 6.5017 29.0753 39.2614 42.6225
frequency: 22.5725 39.2166 42.1001 53.5746 77.2925 88.1677 118.7425 141.7283 174.2825 199.8591 216.5228 229.1417 238.0173 270.5115 290.7419 305.1928 330.7880 339.9036 380.7360 394.0422 405.5428 436.6521 450.9901 483.9304 492.1323 497.5106 523.6174 582.6942 611.3623 617.1357 658.8865 670.1319 687.3268 709.1997 715.8101 724.8468 754.6648 769.4157 789.2161 791.7958 800.0767 825.4948 845.9518 860.5432 878.2296 897.2111 912.4543 919.9780 933.8802 947.0239 971.5330 983.4711 989.8216 993.3326 1004.1604 1011.7282 1023.8260 1026.8490 1033.0570 1047.1843 1056.2520 1057.6798 1059.8201 1073.4803 1094.2259 1112.1742 1132.0982 1158.6395 1172.3882 1181.8986 1187.4528 1191.0862 1199.4783 1209.5885 1231.6261 1236.7765 1253.3233 1257.7092 1260.7768 1268.0852 1287.6498 1308.9594 1315.0382 1327.3426 1336.1969 1339.5033 1342.1360 1346.1091 1351.0110 1355.2656 1366.6354 1378.3576 1387.7519 1418.6314 1444.9274 1455.6490 1463.2386 1467.1855 1467.3816 1475.7279 1482.5160 1490.3954 1492.1737 1593.3208 1616.2042 1636.5544 2961.9810 2966.6520 2968.8452 2970.4893 2974.5764 2975.4061 3000.1522 3010.1445 3032.8303 3033.5387 3034.2686 3039.5803 3041.7832 3051.0074 3084.3354 3110.6212 3123.7257 3136.0037 3146.2585 3160.8274 3399.7572 3426.6887 3427.2322
redmass: 3.7613 3.9286 3.5152 4.6480 6.6975 3.8195 5.0774 3.8750 3.5070 3.7265 3.7408 1.9577 3.5715 5.0481 4.7743 6.2440 3.7363 1.8698 4.5234 4.2705 2.8570 2.7193 3.6260 2.1947 1.6500 1.4417 3.6132 4.8904 3.7680 5.7189 3.7240 2.8546 3.8020 1.9564 2.6006 5.9759 2.4756 3.0053 2.2077 1.6273 2.5689 3.5781 2.1509 1.2588 1.7340 1.5611 2.4666 1.8180 1.5179 2.3666 2.6854 1.3711 6.0433 2.5136 1.3658 3.4963 2.6484 2.8116 2.4466 1.8006 2.5692 1.4356 2.0711 1.3516 1.6573 2.5136 2.7611 2.3356 1.0618 2.2277 1.4319 1.5215 1.3294 1.5218 1.8254 1.4372 1.4851 1.3222 1.2894 1.4937 1.4435 1.3112 1.5613 1.3372 1.3583 1.4165 1.4541 1.4731 1.2345 1.5119 1.6684 1.8376 2.9165 2.3312 2.1058 1.1321 1.0904 1.0906 1.0878 1.0830 1.1007 1.3134 1.6692 5.7901 5.7362 10.1626 1.0640 1.0634 1.0637 1.0649 1.0625 1.0619 1.0819 1.0854 1.0973 1.0963 1.0980 1.1005 1.1015 1.1029 1.0878 1.0872 1.0865 1.0919 1.0960 1.1016 1.0764 1.0754 1.0653
irintensity: 0.5098 0.1198 0.0705 1.0311 1.7220 1.0326 0.7707 1.3026 1.6039 1.7211 5.8707 1.8147 6.1365 1.0949 2.1153 18.8477 7.4010 0.8525 16.3599 4.8834 0.0016 1.5978 3.1609 22.0253 15.8636 44.7964 23.8657 9.7892 6.4397 1.6710 20.0724 95.6671 17.3335 9.0115 153.5513 1.1722 40.3430 18.2916 9.6959 8.2003 23.8250 9.2466 3.8614 0.0434 5.8517 16.5877 2.7723 0.1125 3.0059 38.3441 7.8027 0.0786 0.1146 34.8376 3.9044 36.3966 10.1196 25.5419 9.0943 0.9491 20.0939 2.3566 13.0754 3.0705 16.5912 0.2712 12.0500 7.0138 0.1486 25.0289 8.9244 1.5842 5.9374 6.8131 25.8221 69.6932 29.4876 11.2475 7.7078 122.4334 9.8345 0.2781 9.7365 13.6678 0.4748 0.3556 0.5226 4.1724 4.2518 28.9052 15.5399 2.9629 4.7472 27.2421 9.0969 16.4091 1.8599 6.0652 10.0214 19.4882 3.4595 0.2525 24.3028 2.8861 5.8233 281.8838 9.5578 23.4563 23.8709 61.6512 29.5836 31.5496 24.0030 28.6501 61.3605 51.8306 48.6388 0.8440 6.9232 104.3288 7.9392 9.5591 3.3110 28.4899 8.4705 42.8358 8.4858 6.0198 40.2449
temp: 298.150 k
press: 1.00000 atm
elementType: 8 8 7 7 7 6 6 6 6 6 6 6 6 6 6 6 6 6 6 6 6 6 1 1 1 1 1 1 1 1 1 1 1 1 1 1 1 1 1 1 1 1 1 1 1
symmnumber: 1
zpe: 996782.0 jmol-1
zpe.correction: 0.379654 hartree
zpe.thermalcorrener: 0.399010 hartree
zpe.thermalcorrenthalpy: 0.399954 hartree
zpe.thermalcorrgfe: 0.331020 hartree
zpe.sumelectzpe: -974.640490 hartree
zpe.sumelectthermal: -974.621134 hartree
zpe.sumelectthermalent: -974.620190 hartree
zpe.sumelectthermalfe: -974.689124 hartree
dipole: -2.2463 -4.3269 -1.6512
dipole: 5.1473
quadrupole: -121.6414 -131.6073 -135.7838
quadrupole: 5.8009 -1.5835 -5.2513
quadrupole: 8.0361 -1.9298 -6.1063 5.8009 -1.5835 -5.2513
hfenergy: -975.020144 hartree
pointgroup: C01 [X(C17H23N3O2)]
dipole: 0.8243285 -1.8432911 0.1543299 debye
polarizability: 267.7534025|3.2625051|183.6116497|-11.8401541|21.0126628|156.2738299 unknown
InChI: InChI=1S/C17H23N3O2/c21-16-17(22)14(11-20(16)13-9-5-2-6-10-13)15(18-19-17)12-7-3-1-4-8-12/h1,3-4,7-8,13-15,18-19,22H,2,5-6,9-11H2
charge 0 multiplicity 1
45 atoms
O  -1.026102 2.13205 1.099137
O  1.648607 2.504422 0.256095
N  1.64355 0.140333 0.052841
N  -1.079703 1.467698 -1.228847
N  -1.627687 0.229996 -1.757405
C  -0.711516 -0.300627 0.403911
C  -0.470499 1.214115 0.122836
C  0.66249 -0.969093 0.077764
C  -1.831868 -0.72205 -0.593069
C  3.10835 -0.057661 -0.007314
C  1.064301 1.384392 0.133912
C  3.659676 -0.692714 1.295963
C  3.526819 -0.879846 -1.252042
C  5.199167 -0.839055 1.224559
C  5.066556 -1.02541 -1.318308
C  -3.256068 -0.662558 -0.047934
C  5.63156 -1.650313 -0.020216
C  -4.198294 -1.626169 -0.490058
C  -3.684421 0.346413 0.854314
C  -5.538089 -1.590677 -0.046909
C  -5.027217 0.385527 1.294644
C  -5.958324 -0.580029 0.848736
H  -0.983009 -0.449865 1.459841
H  0.943536 -1.717667 0.840068
H  0.632786 -1.481182 -0.905036
H  -1.652759 -1.745219 -0.975356
H  3.528747 0.964101 -0.098098
H  -1.828499 2.168934 -1.123531
H  3.208314 -1.695815 1.444283
H  3.367724 -0.067571 2.160505
H  3.143885 -0.388516 -2.166731
H  3.070751 -1.890612 -1.202003
H  -0.95467 -0.158768 -2.435201
H  5.572146 -1.32199 2.147851
H  5.660081 0.16904 1.18253
H  5.521148 -0.025036 -1.470509
H  5.347007 -1.639906 -2.1951
H  6.735637 -1.70567 -0.074157
H  5.261896 -2.692523 0.075363
H  -0.36488 2.875165 1.195922
H  -3.880026 -2.407459 -1.19245
H  -2.977184 1.101952 1.213538
H  -6.250937 -2.34598 -0.396994
H  -5.345445 1.171604 1.989094
H  -6.997338 -0.547762 1.195863
