program: Gaussian 09
title: 000289928
version: EM64L-G09RevD.01
frameworkgroup: C1[X(C7H5NS)]
method: RPBEPBE
basis: SDD
operation: Freq
keyword: #pfreq=noraman
keyword: PBEPBE/SDD
title: #p freq=noraman PBEPBE/SDD
converged: NO NO NO NO
title: Mulliken charges:
elementType: S N C C C C C C C H H H H H
charge: 0.324455 0.055213 0.546218 -0.568396 -0.254249 -0.309862 -0.516856 -0.160935 -0.362941 0.254325 0.250661 0.266421 0.230767 0.245179
chargesum: 0.00000
title: Mulliken charges with hydrogens summed into heavy atoms:
elementType: S N C C C C C C C
charge: 0.324455 0.055213 0.546218 -0.568396 0.000076 -0.059201 -0.250434 0.069832 -0.117762
polarizability: 1.39565924e+02 1.97283471e+00 9.75741294e+01 -1.30119362e-04 -1.62406743e-03 3.62879301e+01
1716.lowfreq: -0.0024 -0.0022 -0.0018 7.5272 8.0966 20.7793 183.2477 209.4067 348.4114
frequency: 183.2361 209.4040 348.4113 422.9433 467.0758 468.6661 523.6628 572.5996 639.4321 693.0373 710.0440 749.3520 771.2325 821.3020 852.3791 892.4340 928.8832 980.0235 1032.5653 1051.1538 1099.0265 1123.3646 1219.6894 1243.6256 1319.2071 1349.6785 1375.3302 1432.6553 1482.7646 1546.3508 1578.8803 3135.1329 3142.9301 3167.7157 3170.5061 3223.4946
redmass: 5.7245 4.0756 7.0598 4.1227 3.9610 8.1045 7.9461 3.2021 7.3813 7.9726 1.5127 6.6412 1.7904 1.7512 4.7802 1.3042 1.4227 1.3780 2.5329 2.7812 1.4207 1.3662 1.6198 1.6814 2.6030 4.6060 2.5335 2.3147 5.0965 6.0174 6.5862 1.0876 1.0925 1.0924 1.0992 1.0997
irintensity: 2.4275 5.1661 3.4519 0.0905 4.4090 4.7305 0.2193 3.3600 0.7213 4.4126 62.5551 10.8937 5.9479 74.1158 13.0775 4.6688 1.8418 1.0569 1.5609 16.8157 25.9887 2.9003 0.7323 8.2611 1.7885 10.3996 63.3946 5.7052 19.5271 5.8651 7.3447 1.0069 16.3653 6.9021 22.6066 1.3005
temp: 298.150 k
press: 1.00000 atm
elementType: 16 7 6 6 6 6 6 6 6 1 1 1 1 1
symmnumber: 1
zpe: 262748.9 jmol-1
zpe.correction: 0.100076 hartree
zpe.thermalcorrener: 0.106587 hartree
zpe.thermalcorrenthalpy: 0.107531 hartree
zpe.thermalcorrgfe: 0.068973 hartree
zpe.sumelectzpe: -721.928354 hartree
zpe.sumelectthermal: -721.921843 hartree
zpe.sumelectthermalent: -721.920899 hartree
zpe.sumelectthermalfe: -721.959456 hartree
dipole: -0.5298 3.1818 -0.0002
dipole: 3.2256
quadrupole: -47.9785 -57.9722 -63.2820
quadrupole: 0.8501 0.0001 0.0000
quadrupole: 8.4324 -1.5613 -6.8711 0.8501 0.0001 0.0000
hfenergy: -722.0284296 hartree
pointgroup: C01 [X(C7H5N1S1)]
dipole: -0.0069685 1.2690303 -0.0000891 debye
dipolederiv: -0.3224351 -0.0573666 0.0000161 0.1508856 -0.1661657 -0.0000087 0.0000441 -0.0000448 0.1095656 -0.5500175 0.0782702 0.0000382 -0.0865553 -0.332908 0.0000222 -0.0000043 0.0000081 -0.1885894 0.0551321 -0.0407527 -0.0000002 0.3989055 -0.3013513 0.0000088 0.0000168 0.0000086 0.0912183 0.7685545 -0.1725465 -0.0000816 -0.3954754 0.0997376 -0.0000086 -0.0000367 0.0000137 -0.0788713 -0.1657172 0.2049185 0.0000129 0.0862727 -0.12782 -0.0000173 -0.0000223 0.0000054 -0.1713918 0.1420559 0.0354636 0.0000068 0.0098467 0.182644 -0.0000232 0.0000035 -0.000015 -0.1319025 -0.1267901 0.1022073 0.0000239 -0.0325094 0.4852097 0.0000172 -0.0000205 0.0000106 -0.289481 -0.0518018 -0.106029 0.000002 -0.1977467 -0.2014962 -0.0000067 0.0000071 0.0000074 -0.1265348 0.2511845 -0.0266336 -0.000009 0.1481535 0.3256432 -0.00001 0.0000026 -0.0000245 -0.0894058 0.0826774 0.0089275 -0.000006 -0.0732985 -0.0598906 0.0000071 0.0000026 0.0000065 0.1971587 0.0806632 -0.0158757 0.0000031 0.0218851 -0.0847167 0.0000126 -0.0000079 0.0000116 0.1551361 -0.00493 -0.0237204 -0.0000059 -0.0333846 0.0772349 -0.0000025 0.0000155 0.0000027 0.2134546 -0.0762868 0.0799737 -0.0000039 0.0932437 0.0601754 0.0000047 -0.000002 0.0000052 0.1680295 -0.0822892 -0.0668365 0.0000035 -0.0902229 0.0437038 0.0000046 0.0000015 0.0000044 0.1416138 unknown
polarizability: 139.1253202|-4.7116549|98.0147332|-0.0003864|-0.0015828|36.2879301 unknown
InChI: InChI=1S/C7H5NS/c1-2-6-3-5-9-7(6)8-4-1/h1-5H
charge 0 multiplicity 1
14 atoms
S  1.822466 -1.446653 -0.000158
N  -0.966619 -1.452195 -0.000003
C  0.22998 0.726042 -0.000136
C  0.163444 -0.710774 -0.000048
C  1.593466 1.22169 -0.00017
C  -1.010666 1.419246 -0.000161
C  2.53493 0.21123 -0.000058
C  -2.202291 0.666246 -0.000116
C  -2.137247 -0.755394 -0.000038
H  1.848655 2.284962 -0.000207
H  -1.034351 2.514798 -0.000224
H  3.620722 0.307693 -0.000027
H  -3.180296 1.157514 -0.000141
H  -3.051992 -1.357902 -0.000014
