program: Gaussian 09
title: 000289927
version: EM64L-G09RevD.01
frameworkgroup: C1[X(C11H7NO2S)]
method: RPBEPBE
basis: SDD
operation: Freq
keyword: #p
keyword: freq=noraman
keyword: PBEPBE/SDD
title: #p freq=noraman PBEPBE/SDD
converged: NO NO NO NO
title: Mulliken charges:
elementType: S O O N C C C C C C C C C C C H H H H H H H
charge: 0.757414 -0.522615 -0.522617 -0.017682 -0.148720 -0.048987 0.454066 0.005358 -0.279845 -0.364941 -0.203529 -0.221085 -0.209680 -0.153047 -0.348378 0.274048 0.283564 0.280695 0.245967 0.240418 0.246260 0.253332
chargesum: 0.00000
title: Mulliken charges with hydrogens summed into heavy atoms:
elementType: S O O N C C C C C C C C C C C
charge: 0.757414 -0.522615 -0.522617 -0.017682 -0.148720 -0.048987 0.454066 0.005358 -0.005796 -0.081377 0.077167 0.024882 0.030738 0.093213 -0.095045
polarizability: 2.19990637e+02 8.50754559e-01 1.69255879e+02 1.38249955e-03 1.40706555e-03 7.76508442e+01
1716.lowfreq: -11.3797 -9.7238 -0.0023 -0.0015 -0.0012 6.6547 72.5592 89.7909 101.1445
frequency: 72.5590 89.7895 101.1309 145.9013 169.7688 173.6509 276.4853 284.0097 293.1882 367.4548 415.1840 432.8937 436.4193 440.7018 490.4451 506.5909 561.9325 604.8526 653.1325 664.2216 715.6004 758.4536 760.4877 794.8429 804.3466 810.8915 886.4248 929.6399 941.6819 965.0215 976.1475 982.5263 996.8448 1004.6680 1008.9644 1030.5097 1072.1968 1109.3889 1127.0495 1173.9856 1208.7875 1261.9554 1300.1770 1327.8247 1379.2027 1407.9692 1423.8329 1439.1907 1465.6298 1528.0936 1581.0870 1583.0746 1609.4744 3144.9029 3145.3239 3158.2997 3161.5272 3169.3508 3179.0842 3181.3070
redmass: 5.3592 9.2363 6.8059 4.6407 8.9888 5.9091 9.8679 5.3031 5.7983 7.4575 3.4197 13.9124 15.4043 4.2024 6.4850 4.5434 3.1379 7.7047 7.1382 7.9892 4.2388 1.6547 6.2327 2.7269 1.2659 17.0329 1.3619 20.0169 1.3581 1.3970 8.3786 1.4025 6.8756 1.3547 3.4473 2.4324 2.0529 1.7192 1.3924 1.0777 1.6337 1.5458 2.8375 4.7961 2.3211 5.0080 1.9968 2.3436 3.1874 6.5490 6.9495 7.2122 7.6104 1.0892 1.0866 1.0904 1.0917 1.0954 1.1006 1.0999
irintensity: 8.0339 0.1326 0.2732 0.5953 9.7176 4.2389 6.2711 1.1776 6.8177 1.1806 5.1801 27.5619 41.5685 1.8457 8.6670 9.3659 0.0278 5.8521 0.7781 10.7223 6.7868 78.1011 1.2436 23.5779 41.1105 94.0807 0.7531 83.4865 0.3292 1.0366 2.0104 0.0547 0.5248 0.3579 0.6928 3.4267 8.2787 6.9785 1.7138 0.4665 0.0959 1.7382 0.1089 8.5484 25.9846 11.1512 48.4339 2.2754 3.4124 16.0595 17.0280 19.0690 0.9810 10.5691 4.5502 4.1770 1.7371 1.1999 19.9016 14.5180
temp: 298.150 k
press: 1.00000 atm
elementType: 16 8 8 7 6 6 6 6 6 6 6 6 6 6 6 1 1 1 1 1 1 1
symmnumber: 1
zpe: 398871.3 jmol-1
zpe.correction: 0.151922 hartree
zpe.thermalcorrener: 0.163855 hartree
zpe.thermalcorrenthalpy: 0.164799 hartree
zpe.thermalcorrgfe: 0.113592 hartree
zpe.sumelectzpe: -1025.422411 hartree
zpe.sumelectthermal: -1025.410479 hartree
zpe.sumelectthermalent: -1025.409534 hartree
zpe.sumelectthermalfe: -1025.460741 hartree
dipole: -0.3887 -4.9592 0.0003
dipole: 4.9744
quadrupole: -61.4970 -104.4552 -104.9104
quadrupole: -1.5010 -0.0010 -0.0006
quadrupole: 28.7906 -14.1677 -14.6228 -1.5010 -0.0010 -0.0006
hfenergy: -1025.5743333 hartree
pointgroup: C01 [X(C11H7N1O2S1)]
dipole: 0.1530287 -1.9511014 -0.0001099 debye
dipolederiv: 1.2026605 -0.0268441 0.0000029 0.0259417 1.486657 -0.0000072 -0.0000011 -0.0000091 1.2848178 -0.5205591 0.0076509 -0.0056436 -0.0037195 -0.6384476 -0.0360946 0.0133085 -0.199082 -0.6130759 -0.5205576 0.007645 0.0056443 -0.0037165 -0.6384479 0.0360957 -0.013312 0.1990905 -0.6130792 -0.4676785 0.0076932 0.0000439 0.2390252 -0.3969504 0.0000003 -0.0000182 -0.0000152 -0.2057516 -0.006098 0.0992842 0.0000004 -0.0133776 -0.1035753 0.0000051 0.0000219 -0.0000006 -0.232973 -0.3764147 -0.074417 -0.000022 -0.3490787 -0.1077194 0.0000027 0.0000148 -0.0000128 -0.19209 -0.2567236 -0.0493186 -0.0000013 0.0119617 -0.0801221 -0.0000007 -0.0000071 0.0000012 0.0409124 0.6031337 0.0587056 0.0000098 0.1437699 0.0786724 0.0000157 -0.0000448 -0.0000019 0.0827683 -0.1539522 -0.0640859 0.0000015 -0.3201294 -0.0555977 -0.0000025 0.000002 0.0000026 -0.0625579 -0.0473605 -0.0815924 -0.0000021 -0.0380945 0.030029 -0.0000018 0.0000117 0.0000028 -0.107415 0.196778 0.0139707 0.0000203 0.2129624 0.0410579 -0.0000225 0.000039 -0.0000075 -0.0447309 0.0666366 -0.0526085 0.0000018 0.0842711 0.0148317 -0.0000017 0.0000054 -0.0000004 -0.1314802 0.0363155 0.1562509 -0.0000003 0.1493172 0.0536095 0.0000004 -0.0000013 -0.0000024 -0.1289592 -0.0450098 0.0039372 -0.0000375 0.1392187 -0.2005909 0.0000069 -0.0000417 -0.000026 -0.0910094 0.1880364 -0.0558952 -0.000049 -0.3145332 0.3396465 0.0000059 -0.0000889 0.0001482 -0.0525727 0.0948834 0.0057368 -0.0000005 0.059143 0.014859 0.000001 -0.0000048 -0.0000027 0.1509228 0.0880027 0.0503713 -0.0000006 0.0229547 0.0056353 0.0000003 0.0000036 0. 0.1583775 0.0998651 -0.007657 0.0000074 -0.0624682 0.031837 0.0000032 -0.0000097 0.0000189 0.1394587 -0.1008484 0.003249 -0.0000025 0.0019144 0.0797536 0. -0.0000024 0.0000007 0.1625232 0.0046747 -0.0902907 -0.0000015 -0.1070804 -0.0254607 -0.0000003 -0.0000046 0.0000007 0.1559995 -0.0844034 0.0080482 0.0000138 0.0071093 0.088572 0.0000075 0.0000174 0.0000097 0.1669183 -0.0013806 0.0801664 0.0000148 0.1146088 -0.0182491 -0.0000134 0.0001122 -0.0001147 0.1329964 unknown
polarizability: 219.9907191|-0.8482887|169.2557963|0.0013826|-0.001407|77.6508442 unknown
InChI: InChI=1S/C11H7NO2S/c13-15(14)9-5-2-1-4-8(9)11-10(15)6-3-7-12-11/h1-7H
charge 0 multiplicity 1
22 atoms
S  0.013598 1.911086 0.000089
O  0.01983 2.7420 1.404433
O  0.019868 2.741983 -1.404265
N  1.499893 -1.875611 0.000127
C  -1.325384 0.544724 0.000078
C  1.353999 0.545717 0.000113
C  -0.727128 -0.734088 0.000086
C  0.75198 -0.732132 0.000063
C  -2.702533 0.765305 0.000068
C  -1.567388 -1.868939 0.000093
C  2.736603 0.721641 0.000127
C  -3.534816 -0.384623 0.00007
C  -2.968494 -1.683378 0.000081
C  3.514742 -0.464936 0.0001
C  2.858077 -1.72046 0.000291
H  -3.126135 1.773804 0.00006
H  -1.116356 -2.865711 0.000089
H  3.200122 1.71245 0.000083
H  -4.622733 -0.263241 0.000059
H  -3.627559 -2.557578 0.000075
H  4.607322 -0.417403 -0.00004
H  3.438392 -2.649511 0.000021
