program: Gaussian 09
title: 000289926
version: EM64L-G09RevD.01
frameworkgroup: C1[X(C7H4BrNS)]
method: RPBEPBE
basis: SDD
operation: Freq
keyword: #p
keyword: freq=noraman
keyword: PBEPBE/SDD
title: #p freq=noraman PBEPBE/SDD
converged: NO NO NO NO
title: Mulliken charges:
elementType: Br S N C C C C C C C H H H H
charge: 0.025871 0.344385 0.060354 0.657045 -0.579229 -0.194219 -0.280470 -0.542369 -0.161911 -0.360704 0.263068 0.283356 0.235380 0.249442
chargesum: 0.00000
title: Mulliken charges with hydrogens summed into heavy atoms:
elementType: Br S N C C C C C C C
charge: 0.025871 0.344385 0.060354 0.657045 -0.579229 -0.194219 -0.017402 -0.259013 0.073469 -0.111262
polarizability: 1.51309492e+02 -6.71912137e+00 1.34957811e+02 1.89793185e-03 1.14408216e-03 4.00920146e+01
1716.lowfreq: -8.8593 -1.2520 -0.0004 0.0013 0.0025 8.0050 116.5654 140.8600 199.4647
frequency: 116.5572 140.8558 199.4624 230.8487 275.1097 378.7634 426.9993 475.3365 482.7181 534.5116 600.0191 671.3391 732.1442 751.2526 762.5443 777.8648 819.8291 898.4662 933.4211 984.8626 1033.4336 1056.4867 1122.4666 1170.7034 1240.5519 1309.7116 1346.4802 1368.1455 1430.4240 1479.1593 1538.8901 1575.9563 3143.3813 3151.8059 3176.0335 3234.4765
redmass: 5.9180 8.6806 5.7177 5.8291 20.9053 10.2359 4.2896 3.9807 9.5850 7.7622 4.3809 7.2636 7.9705 2.2579 6.6625 1.4575 1.6603 6.5484 1.4015 1.3685 2.5098 3.6327 1.4960 1.4703 1.7682 2.6378 6.0138 2.6122 2.3017 6.4297 6.7399 6.7620 1.0877 1.0926 1.0996 1.0964
irintensity: 0.8172 0.9839 8.3507 0.0376 1.5331 1.0640 0.3872 0.1969 10.0364 1.1881 3.8206 7.8123 13.9992 42.4339 22.0447 3.6333 65.6519 57.0458 0.6405 0.7467 2.9149 17.3953 2.1853 1.3760 7.5751 28.7214 9.6978 70.0742 0.5375 0.7562 31.8335 12.1911 2.5290 9.8674 20.0077 3.9905
temp: 298.150 k
press: 1.00000 atm
elementType: 35 16 7 6 6 6 6 6 6 6 1 1 1 1
symmnumber: 1
zpe: 236687.2 jmol-1
zpe.correction: 0.090149 hartree
zpe.thermalcorrener: 0.098201 hartree
zpe.thermalcorrenthalpy: 0.099145 hartree
zpe.thermalcorrgfe: 0.055694 hartree
zpe.sumelectzpe: -734.715028 hartree
zpe.sumelectthermal: -734.706977 hartree
zpe.sumelectthermalent: -734.706032 hartree
zpe.sumelectthermalfe: -734.749483 hartree
dipole: -0.6419 -1.5816 -0.0001
dipole: 1.7069
quadrupole: -76.3993 -64.2168 -77.5973
quadrupole: -8.1001 -0.0005 0.0001
quadrupole: -3.6615 8.5210 -4.8595 -8.1001 -0.0005 0.0001
hfenergy: -734.8051773 hartree
pointgroup: C01 [X(C7H4Br1N1S1)]
dipole: -0.045852 0.6699855 -0.0001451 debye
dipolederiv: -0.3485077 -0.2584762 0.000086 -0.3629657 -0.3721356 0.0001089 0.0002168 0.0001988 0.0046301 -0.2583608 -0.0596333 0.0000792 0.1408884 -0.2535349 0.0000269 0.0000721 0.0000114 0.1259855 -0.5815419 0.1276016 0.0000819 -0.0499689 -0.3923745 0.0000336 0.0000904 0.0000394 -0.1858738 0.005507 -0.2669415 0.0000581 -0.0312815 -0.5048324 0.0000915 0. 0.0000729 0.1230806 0.4081591 -0.338036 -0.0000937 -0.4691406 0.4319308 0.0000272 0.0000266 0.0000785 -0.0679365 0.5430609 0.6213529 -0.0001806 0.6660392 0.4246096 -0.0001932 -0.0003378 -0.0002902 -0.1315924 0.193818 0.0628163 -0.0000494 -0.0157337 0.1135238 -0.0000466 -0.0000533 -0.0000525 -0.1131554 -0.1145051 0.2275411 -0.0000248 0.100736 0.1598586 -0.0000571 -0.0001147 -0.0001158 -0.2347537 -0.216572 -0.1373693 0.0000381 -0.2052774 -0.0399134 0.0000105 0.0000534 -0.0000009 -0.1191952 0.355357 -0.0036954 -0.000075 0.1687519 0.2770925 -0.0000708 -0.0001002 -0.00007 -0.07924 0.078033 -0.0686335 0.0000245 -0.0307658 -0.0145919 0.0000253 0.0000259 0.000051 0.1563608 0.0316084 0.0005776 0.0000161 -0.0134005 0.1024426 0.0000169 0.0000968 0.0000643 0.2134106 0.0166792 0.0874597 0.0000048 0.1129862 -0.0179447 0.0000163 0.0000013 0.0000201 0.165939 -0.1127351 0.0054361 0.0000349 -0.0108677 0.0858694 0.0000106 0.0000226 -0.0000068 0.1423403 unknown
polarizability: 153.4616725|2.307136|132.8056253|-0.0179689|-0.0150532|40.0920197 unknown
InChI: InChI=1S/C7H4BrNS/c8-6-4-10-7-5(6)2-1-3-9-7/h1-4H
charge 0 multiplicity 1
14 atoms
Br 2.862642 1.72612 -0.000849
S  0.699222 -2.279857 -0.000043
N  -1.811537 -1.075906 0.000285
C  0.197908 0.375109 -0.000298
C  -0.473847 -0.894765 0.00004
C  1.638903 0.21154 -0.000478
C  -0.619338 1.535081 -0.000374
C  2.06293 -1.09969 -0.000285
C  -2.017967 1.366113 -0.000127
C  -2.570817 0.054774 0.000193
H  -0.162967 2.530449 -0.000609
H  3.085821 -1.4726 -0.000354
H  -2.689071 2.230135 -0.000188
H  -3.655181 -0.097201 0.000386
