program: Gaussian 09
title: 000289925
version: EM64L-G09RevD.01
frameworkgroup: C1[X(C8H5NOS)]
method: RPBEPBE
basis: SDD
operation: Freq
keyword: #p
keyword: freq=noraman
keyword: PBEPBE/SDD
title: #p freq=noraman PBEPBE/SDD
converged: YES YES YES YES
title: Mulliken charges:
elementType: S O N C C C C C C C C H H H H H
charge: 0.318998 -0.188711 0.062376 0.566659 -0.551963 -0.345432 -0.126785 -0.313144 -0.153627 -0.358246 -0.131873 0.293475 0.259085 0.237317 0.251452 0.180419
chargesum: 0.00000
title: Mulliken charges with hydrogens summed into heavy atoms:
elementType: S O N C C C C C C C C
charge: 0.318998 -0.188711 0.062376 0.566659 -0.551963 -0.051957 -0.126785 -0.054059 0.083690 -0.106794 0.048546
polarizability: 1.93995980e+02 3.63426098e+00 1.11457637e+02 7.29645092e-03 6.01692298e-04 4.12105951e+01
1716.lowfreq: -11.9844 -1.9852 -0.0030 -0.0030 -0.0023 5.7255 88.0332 147.5421 164.6742
frequency: 88.0318 147.5416 164.6736 195.7810 287.9801 336.7370 394.9002 442.7910 465.6660 481.5177 514.0053 563.4762 625.1335 690.8905 753.7989 757.6016 802.2638 859.9666 886.9455 936.0446 974.2776 985.6128 1030.7581 1062.2462 1105.1591 1122.6834 1182.2668 1240.1242 1316.7064 1354.5813 1376.1462 1388.4622 1439.2774 1501.4250 1550.5300 1579.7158 1593.6178 2906.4412 3143.4835 3150.7019 3178.3325 3179.7938
redmass: 7.6869 8.2184 3.2203 4.5619 3.9636 8.6177 9.0221 4.2691 8.1599 4.0544 10.1744 3.0733 7.1265 7.4050 6.1459 3.1657 1.3913 4.7943 1.4601 1.4332 1.7391 1.3969 2.8011 4.2011 4.3628 1.4797 1.4202 1.8618 2.8258 5.9444 2.3898 1.3251 2.4514 6.1236 6.7311 6.3188 6.7463 1.0858 1.0881 1.0928 1.0994 1.0953
irintensity: 2.8674 6.5253 17.0749 2.0294 0.0027 5.5472 0.9906 0.0466 2.3345 15.5617 15.0681 2.8288 0.0051 3.3930 50.2738 21.3247 25.7345 1.3816 36.1624 1.8253 4.4274 1.8567 2.1397 0.5907 106.9696 2.0672 34.2511 5.5024 8.1464 33.6473 15.3821 12.6967 10.4407 187.7809 90.1655 63.6749 112.7338 101.4811 2.5390 9.9236 21.1589 0.4590
temp: 298.150 k
press: 1.00000 atm
elementType: 16 8 7 6 6 6 6 6 6 6 6 1 1 1 1 1
symmnumber: 1
zpe: 285656.8 jmol-1
zpe.correction: 0.108801 hartree
zpe.thermalcorrener: 0.117474 hartree
zpe.thermalcorrenthalpy: 0.118419 hartree
zpe.thermalcorrgfe: 0.074568 hartree
zpe.sumelectzpe: -835.112907 hartree
zpe.sumelectthermal: -835.104233 hartree
zpe.sumelectthermalent: -835.103289 hartree
zpe.sumelectthermalfe: -835.147140 hartree
dipole: 3.3224 1.4036 0.0010
dipole: 3.6067
quadrupole: -72.2704 -69.0464 -72.6688
quadrupole: 13.0139 -0.0033 0.0024
quadrupole: -0.9419 2.2822 -1.3403 13.0139 -0.0033 0.0024
hfenergy: -835.2217078 hartree
pointgroup: C01 [X(C8H5N1O1S1)]
dipole: 1.292467 -0.5857153 -0.0003902 debye
dipolederiv: -0.2508021 0.0077493 0.0000008 0.1661469 -0.1828733 -0.0000167 -0.0000823 -0.0000309 0.112439 -1.1557748 -0.1261929 -0.0000556 -0.6335074 -0.5118783 -0.0001269 0.0005102 0.0002174 -0.3199004 -0.5942058 0.1698606 0.0000225 -0.0398272 -0.3265303 -0.000009 0.0000024 0.000002 -0.1903223 -0.2336543 -0.1769326 -0.0000119 0.1751511 -0.3124297 -0.0000427 0.0000303 -0.0000419 0.0793927 0.6275622 -0.2601647 -0.0000161 -0.2278761 0.2073563 0.0000207 -0.000074 0.0000511 -0.0560489 0.2869335 0.177588 0.000032 -0.139927 -0.1377071 0.0000004 -0.0001128 0.0000409 -0.095843 -1.0751646 0.282365 0.0001089 0.6159244 0.3872209 0.0000153 0.0000091 -0.000058 -0.1405448 0.300917 0.0964636 0.0000091 -0.0623077 0.1748377 0.0000251 0.0000352 0.00002 -0.1143101 -0.1667775 -0.1750626 -0.0000076 -0.3574068 -0.2027704 -0.0000043 -0.0000337 -0.0000056 -0.1163137 0.2675281 -0.0370781 0.0000004 0.2261155 0.3828858 0.0000253 0.0000278 0.0000108 -0.0674694 1.9468928 0.0148478 -0.0001179 0.0951232 0.6584272 0.0002409 -0.0005031 0.0000624 0.1444635 0.0827486 -0.0063341 -0.0000015 -0.0450276 0.0208874 -0.0000161 -0.0000245 -0.0000195 0.1897471 0.0833973 -0.0395371 -0.0000037 0.0044665 -0.0558581 -0.000013 0.0000027 -0.0000103 0.1537178 -0.0435544 0.0885976 0.0000037 0.1038904 0.0383813 -0.0000073 0.0000044 -0.0000065 0.167999 -0.0882235 -0.0407573 -0.000003 -0.0601086 0.0700813 -0.0000031 -0.0000012 -0.0000039 0.1395394 0.0121774 0.0245875 0.00004 0.1791704 -0.2100307 -0.0000885 0.0002096 -0.000228 0.1134543 unknown
polarizability: 193.7541266|-5.7542625|111.6994903|-0.0072785|0.0007894|41.2105951 unknown
InChI: InChI=1S/C8H5NOS/c10-5-7-4-6-2-1-3-9-8(6)11-7/h1-5H
charge 0 multiplicity 1
16 atoms
S  -0.777522 1.767427 0.000038
O  -3.937084 -0.76492 0.000676
N  1.972514 1.347587 0.000015
C  0.467131 -0.629132 -0.000096
C  0.746936 0.783487 -0.000018
C  -0.940831 -0.920164 -0.000117
C  -1.741239 0.217038 -0.000097
C  1.592501 -1.500929 -0.00014
C  2.878973 -0.933688 -0.0001
C  3.025909 0.483098 -0.000025
C  -3.210161 0.267366 -0.000198
H  -1.373384 -1.923942 -0.00019
H  1.451855 -2.586882 -0.000199
H  3.77266 -1.564198 -0.000124
H  4.020007 0.942496 0.00001
H  -3.658668 1.290056 0.000665
