program: Gaussian 09
title: 000289924
version: EM64L-G09RevD.01
frameworkgroup: C1[X(C10H6N2S)]
method: RPBEPBE
basis: SDD
operation: Freq
keyword: #p
keyword: freq=noraman
keyword: PBEPBE/SDD
title: #p freq=noraman PBEPBE/SDD
converged: NO NO NO NO
title: Mulliken charges:
elementType: S N N C C C C C C C C C C H H H H H H
charge: 0.304240 -0.006294 0.057452 0.514185 -0.014585 -0.243721 -0.556750 -0.310673 -0.188995 -0.161774 -0.162622 -0.364117 -0.364757 0.280878 0.256093 0.234074 0.234038 0.245503 0.247825
chargesum: 0.00000
title: Mulliken charges with hydrogens summed into heavy atoms:
elementType: S N N C C C C C C C C C C
charge: 0.304240 -0.006294 0.057452 0.514185 -0.014585 -0.243721 -0.556750 -0.029794 0.067098 0.072301 0.071416 -0.118614 -0.116932
polarizability: 2.19269323e+02 2.02617265e+00 1.39269320e+02 7.00940187e-04 -4.87148264e-04 5.02464017e+01
1716.lowfreq: -0.0015 0.0017 0.0026 7.2867 10.4541 12.7859 104.2844 136.6734 209.5795
frequency: 104.2710 136.6727 209.5781 213.2845 282.1869 397.4980 408.7897 426.9806 447.5863 473.6085 493.9795 499.5562 579.9474 607.1706 671.4754 699.3514 746.2013 779.1825 785.8588 797.3799 828.3116 929.1918 942.6501 977.3020 990.3206 990.7521 1004.7928 1032.5351 1053.1771 1096.8618 1114.8294 1141.5566 1209.0864 1248.7812 1317.2317 1323.4265 1348.4925 1375.3112 1383.4959 1426.4786 1458.7705 1527.1117 1539.0975 1563.5647 1587.8537 3138.2372 3142.3210 3149.7478 3157.1459 3170.7295 3176.0200
redmass: 5.2144 4.7198 5.4791 6.6104 4.9825 7.6118 13.2300 4.1929 4.3928 13.5159 3.9761 6.7976 3.4545 8.2202 7.8844 7.8770 4.9779 2.3062 6.9669 1.3015 1.9634 1.3684 1.4080 1.3695 7.1938 1.3806 5.4888 2.7530 2.6400 2.8851 1.4896 1.5131 1.8039 1.7743 2.6298 8.5391 3.7172 2.2744 2.2174 1.9684 3.2668 5.7928 6.4358 6.6290 7.3154 1.0873 1.0881 1.0924 1.0920 1.1000 1.1001
irintensity: 2.5624 4.8314 5.0006 3.2733 0.2735 4.1025 2.1803 0.0017 0.0089 3.5130 2.9884 3.8837 3.0005 4.1892 1.8985 9.9982 0.5186 43.8085 3.9208 69.9382 13.4832 0.0570 0.0473 0.6081 0.0195 0.6651 21.2422 4.5592 12.7392 27.9414 1.0496 9.9355 8.9072 4.1686 1.9074 4.0800 13.1543 71.3361 79.9219 4.3749 1.6056 7.7500 18.8796 0.8003 39.7649 5.1979 5.6808 11.7845 9.4868 25.9763 20.1187
temp: 298.150 k
press: 1.00000 atm
elementType: 16 7 7 6 6 6 6 6 6 6 6 6 6 1 1 1 1 1 1
symmnumber: 1
zpe: 353530.9 jmol-1
zpe.correction: 0.134653 hartree
zpe.thermalcorrener: 0.143729 hartree
zpe.thermalcorrenthalpy: 0.144673 hartree
zpe.thermalcorrgfe: 0.100007 hartree
zpe.sumelectzpe: -891.359014 hartree
zpe.sumelectthermal: -891.349938 hartree
zpe.sumelectthermalent: -891.348994 hartree
zpe.sumelectthermalfe: -891.393660 hartree
dipole: 1.6355 -1.1420 0.0001
dipole: 1.9947
quadrupole: -63.9934 -82.1852 -85.6670
quadrupole: 9.4886 0.0002 -0.0001
quadrupole: 13.2885 -4.9033 -8.3852 9.4886 0.0002 -0.0001
hfenergy: -891.4936669 hartree
pointgroup: C01 [X(C10H6N2S1)]
dipole: 0.6465171 0.444869 -0.0000281 debye
dipolederiv: -0.5286141 0.048632 0.0000009 0.0942734 -0.2163794 0.0000042 -0.0000018 0.0000019 0.0744111 -0.259964 -0.0190431 0.0000005 -0.0530427 -0.3472684 -0.0000022 -0.0000027 0.0000013 -0.213217 -0.7114409 0.2352096 -0.0000034 0.0211843 -0.362204 0.000001 -0.0000055 0.0000033 -0.1942075 -0.0906326 -0.1524461 -0.0000021 0.3218769 -0.3535236 0.0000037 -0.0000037 0.0000035 0.0638101 0.4208872 0.1369075 0.0000011 -0.3222932 -0.0324488 0.0000067 0.0000069 0.0000023 0.0529092 0.0849108 0.3902776 -0.0000057 0.7052306 0.1677733 -0.0000073 -0.0000079 -0.0000034 -0.0586879 0.705345 -0.4087693 0.0000097 -0.6089589 0.4221933 -0.0000049 0.000012 -0.0000058 -0.0466571 0.2334616 0.0402399 0.0000016 -0.0657705 0.132228 -0.0000029 0.000003 -0.0000041 -0.0941971 0.1270875 -0.1469003 -0.0000033 -0.1321461 0.0897584 0.0000024 -0.0000058 0.0000035 -0.0992685 -0.2409217 -0.147639 0.0000012 -0.2624195 -0.1027455 -0.0000009 -0.000001 -0.0000019 -0.124398 -0.0314034 0.0142696 -0.000003 -0.2131526 -0.087763 0.0000016 0.0000061 -0.0000006 -0.1101467 0.0384267 0.0813013 -0.0000082 0.3091641 0.2556577 -0.0000048 -0.0000096 -0.0000073 -0.0851419 0.3409635 -0.0573705 0.0000037 0.1606324 0.3208716 0.0000002 0.0000003 -0.0000007 -0.0762756 0.0962936 -0.0556376 0.0000003 -0.0203741 -0.0002671 0.0000013 0.0000001 0.000002 0.1490565 0.0830361 0.0247061 0.0000017 0.0805175 -0.0311007 -0.0000014 0.0000022 -0.0000005 0.1523505 -0.0082755 0.0924546 -0.000001 0.1206476 -0.0095821 0.0000011 -0.0000018 0.0000019 0.1660851 -0.114731 0.0130465 0.0000042 0.0133039 0.0973407 -0.0000005 0.0000031 0. 0.1662665 -0.0229582 -0.0866556 0.0000036 -0.1238912 -0.0276122 0.0000031 0.0000062 0.0000045 0.1382684 -0.1214706 -0.0025832 -0.0000017 -0.024782 0.0850717 -0.0000006 -0.0000002 0. 0.1390397 unknown
polarizability: 219.2378023|-2.5741108|139.3008409|-0.0007043|-0.0004823|50.2464017 unknown
InChI: InChI=1S/C10H6N2S/c1-3-7-9-8(4-2-5-11-9)13-10(7)12-6-1/h1-6H
charge 0 multiplicity 1
19 atoms
S  -0.031981 -2.22554 -0.000062
N  1.542341 1.49088 -0.000089
N  -2.612609 -1.172637 -0.000092
C  -0.713248 0.40967 -0.000077
C  0.743853 0.382039 -0.000081
C  1.264272 -0.956248 -0.000076
C  -1.292176 -0.898266 -0.000072
C  -1.598703 1.511845 -0.000091
C  2.658997 -1.158351 -0.000111
C  -2.986441 1.252915 -0.000095
C  3.482177 -0.009561 -0.000126
C  2.887869 1.281214 -0.000116
C  -3.446535 -0.090993 -0.000099
H  -1.195069 2.529053 -0.000101
H  3.095683 -2.162148 -0.000124
H  -3.71256 2.071358 -0.000102
H  4.572459 -0.107509 -0.000142
H  3.512595 2.180849 -0.000139
H  -4.517825 -0.31837 -0.000106
