program: Gaussian 09
title: 000289923
version: EM64L-G09RevD.01
frameworkgroup: C1[X(C7H6N2S)]
method: RPBEPBE
basis: SDD
operation: Freq
keyword: #pfreq=noraman
keyword: PBEPBE/SDD
title: #p freq=noraman PBEPBE/SDD
converged: NO NO NO NO
title: Mulliken charges:
elementType: S N N C C C C C C C H H H H H H
charge: 0.317995 0.056517 -0.688237 0.420393 0.410523 -0.566968 -0.272717 -0.708774 -0.181932 -0.366330 0.221388 0.265142 0.228579 0.243453 0.310549 0.310417
chargesum: 0.00000
title: Mulliken charges with hydrogens summed into heavy atoms:
elementType: S N N C C C C C C C
charge: 0.317995 0.056517 -0.067271 0.420393 0.410523 -0.566968 -0.051329 -0.443632 0.046648 -0.122876
polarizability: 1.45953903e+02 8.43276136e+00 1.16955832e+02 7.19506274e-04 -4.03445573e-03 4.09310461e+01
1716.lowfreq: -0.0028 -0.0025 0.0018 3.3983 4.4645 17.2505 134.1913 180.3069 205.6230
frequency: 134.1848 180.3011 205.6211 253.2311 260.3801 342.2737 395.8452 430.8714 480.1556 487.5233 521.8186 544.5268 623.3627 681.9272 713.5191 756.4939 760.3127 806.4615 813.3355 914.5181 967.4061 1019.1482 1033.3719 1057.9512 1124.4678 1153.8393 1211.1542 1250.3371 1341.3247 1370.1357 1392.4648 1453.4062 1517.3589 1567.5699 1589.6443 1641.2772 3118.8636 3139.0525 3168.2401 3214.1405 3572.6260 3710.4925
redmass: 2.4751 1.8765 4.0055 3.7854 2.5333 1.2333 7.3995 3.8168 3.5959 9.7405 6.3448 6.1433 2.9011 6.4438 1.7120 2.2591 7.3942 1.8647 3.8202 1.3906 1.3770 2.6806 2.0947 2.5887 1.7800 2.0308 1.4607 1.7492 10.6200 2.2318 2.3309 3.5123 5.6221 6.0790 4.4112 1.2863 1.0895 1.0901 1.0988 1.0947 1.0449 1.1041
irintensity: 15.9425 65.6617 22.8090 1.7497 91.5194 125.2985 0.3814 0.0005 1.0011 5.5906 1.1504 3.6282 7.8194 5.3331 81.7613 12.9348 5.8725 53.8950 15.3077 0.1168 0.5236 8.7231 9.6136 5.3933 29.8267 21.9411 6.8211 1.6267 0.4761 60.3677 40.9683 19.2043 2.5669 13.3854 54.3295 201.8069 11.2602 13.4031 26.1562 7.5110 47.5970 22.7842
temp: 298.150 k
press: 1.00000 atm
elementType: 16 7 7 6 6 6 6 6 6 6 1 1 1 1 1 1
symmnumber: 1
zpe: 304574.8 jmol-1
zpe.correction: 0.116006 hartree
zpe.thermalcorrener: 0.124463 hartree
zpe.thermalcorrenthalpy: 0.125407 hartree
zpe.thermalcorrgfe: 0.082831 hartree
zpe.sumelectzpe: -777.199551 hartree
zpe.sumelectthermal: -777.191095 hartree
zpe.sumelectthermalent: -777.190151 hartree
zpe.sumelectthermalfe: -777.232727 hartree
dipole: -1.2789 4.8023 0.0017
dipole: 4.9696
quadrupole: -52.3299 -60.1314 -70.6030
quadrupole: -0.2138 -0.0036 0.0052
quadrupole: 8.6915 0.8900 -9.5816 -0.2138 -0.0036 0.0052
hfenergy: -777.3155575 hartree
pointgroup: C01 [X(C7H6N2S1)]
dipole: 0.7492509 1.8059411 -0.0006515 debye
dipolederiv: -0.2591241 -0.0052521 -0.0000157 0.2706318 -0.2397962 -0.0000127 0.0000358 -0.0000018 0.1035503 -0.4745082 0.1180082 -0.0000032 -0.0344052 -0.3456581 -0.0000074 -0.0000176 0.0000003 -0.1912446 -0.4736106 -0.5565776 -0.000006 -0.564775 -0.9853793 -0.0003544 -0.0002561 -0.0007235 -0.7474024 0.1237773 -0.3907895 -0.0000266 0.277469 -0.4007844 -0.0000142 -0.000007 -0.0000774 0.0704294 0.233991 0.6853914 0.0000499 0.745475 0.9026599 0.0002095 0.0000264 0.0001595 0.1258205 0.4388894 -0.2831336 0.0000139 -0.6377582 0.4328936 0.0000056 -0.0000242 0.0000093 -0.0672905 0.1431957 0.0631619 0.0000219 0.0208755 0.1051914 0.0000215 0.0000337 0.0000339 -0.136913 -0.0258041 0.4283363 0.0000287 -0.1501692 -0.0394152 0.0000012 -0.0000063 0.0000715 -0.4128952 -0.1521204 -0.1302261 -0.0000149 -0.1667677 -0.1082711 0.0000019 -0.0000183 0.0000159 -0.134788 0.2667616 -0.0104254 0.0000188 0.1450023 0.291336 0.0000298 0.0000205 0.0000229 -0.093641 0.0573484 -0.0932889 -0.0000033 -0.0483336 -0.0982755 -0.0000149 -0.0000034 -0.0000272 0.1515264 -0.056764 -0.010723 0.0000106 -0.0243561 0.0787262 -0.0000109 0.0000124 -0.0000238 0.2371206 -0.0098313 0.0994401 0.0000017 0.1201779 -0.01319 -0.0000108 0.0000047 -0.0000122 0.1687113 -0.1231463 -0.0125786 -0.0000103 -0.0352964 0.0797629 -0.0000054 -0.0000106 -0.0000055 0.1423778 0.1518628 0.0536997 -0.0000974 0.0408535 0.184217 0.0001118 -0.0000085 0.0003903 0.3892099 0.1590829 0.0449573 0.000032 0.0413763 0.155983 0.0000495 0.0002187 0.0001679 0.3954285 unknown
polarizability: 143.2270685|-11.9477525|119.6826669|0.0012482|0.0039034|40.9310461 unknown
InChI: InChI=1S/C7H6N2S/c8-6-4-10-7-5(6)2-1-3-9-7/h1-4H,8H2
charge 0 multiplicity 1
16 atoms
S  0.965483 -2.161156 -0.000167
N  -1.654527 -1.232301 -0.00018
N  2.380754 1.637368 0.00012
C  0.196872 0.419038 -0.000037
C  1.656688 0.443886 -0.000032
C  -0.340045 -0.914478 -0.000129
C  -0.741491 1.483999 0.000025
C  2.199207 -0.836746 -0.000085
C  -2.117079 1.174655 -0.000037
C  -2.527986 -0.187176 -0.000151
H  -0.413473 2.530855 0.000143
H  3.254698 -1.109173 -0.000121
H  -2.873394 1.965681 0.000002
H  -3.591005 -0.451518 -0.00021
H  1.90685 2.534953 -0.00061
H  3.396348 1.629613 -0.000129
