program: Gaussian 09
title: 000289922
version: EM64L-G09RevD.01
frameworkgroup: C1[X(C11H7NO2S)]
method: RPBEPBE
basis: SDD
operation: Freq
keyword: #p
keyword: freq=noraman
keyword: PBEPBE/SDD
title: #p freq=noraman PBEPBE/SDD
converged: NO NO NO NO
title: Mulliken charges:
elementType: S O O N C C C C C C C C C C C H H H H H H H
charge: 0.821764 -0.519224 -0.519224 0.086699 -0.188814 0.429170 0.399542 -0.397167 -0.268600 -0.365026 -0.291527 -0.225042 -0.220230 -0.147884 -0.352710 0.276078 0.240976 0.252230 0.246991 0.238936 0.240392 0.262670
chargesum: 0.00000
title: Mulliken charges with hydrogens summed into heavy atoms:
elementType: S O O N C C C C C C C C C C C
charge: 0.821764 -0.519224 -0.519224 0.086699 -0.188814 0.429170 0.399542 -0.397167 0.007478 -0.124050 -0.039297 0.021949 0.018706 0.092508 -0.090040
polarizability: 2.21660807e+02 3.24701139e+00 1.68685090e+02 -2.18233459e-03 3.18955204e-03 7.81941362e+01
1716.lowfreq: -11.5573 -7.8125 -2.8701 -0.0024 -0.0004 0.0007 66.8262 89.1877 102.1802
frequency: 66.8155 89.1782 102.1628 145.3134 163.6054 176.3626 278.0969 281.9457 288.7467 363.3047 420.2392 427.6474 433.2060 445.9452 481.0039 508.0261 567.7465 599.4328 654.4068 667.5188 726.0204 749.2359 750.5364 776.8513 812.8511 824.5204 875.2970 931.9431 936.7946 955.6761 971.5021 988.9115 997.5224 1009.0788 1028.5576 1033.1321 1075.7288 1109.2275 1125.7559 1177.0261 1214.8246 1262.6302 1304.5918 1343.8665 1369.5146 1404.8228 1429.3933 1440.4840 1462.7578 1550.1287 1572.3377 1588.0289 1609.4463 3139.0997 3148.8159 3151.9465 3161.7589 3163.1505 3177.1747 3182.4562
redmass: 6.3693 6.6166 6.4005 5.1129 10.5268 6.0872 8.5738 6.5437 4.7330 7.9529 3.3704 12.4212 13.5385 3.9299 6.7603 4.0124 3.5755 7.7739 7.0723 7.8591 3.6207 2.2266 6.8730 1.4831 17.2364 1.5980 1.3950 10.5516 1.5027 1.4100 7.6486 1.4056 1.3490 6.3727 2.7502 3.1242 2.2582 1.8386 1.4001 1.0790 1.6662 1.5373 1.8572 5.6953 2.2978 6.0548 2.3726 2.3267 2.9319 5.4982 7.2668 6.8703 7.5064 1.0871 1.0887 1.0897 1.0920 1.0946 1.1005 1.1001
irintensity: 0.6186 0.8735 0.1395 0.8434 8.9412 2.4412 6.9964 7.1612 1.4613 1.8377 3.5696 21.1606 32.5148 0.8710 28.4003 14.3851 3.1162 0.2003 0.3516 6.5755 0.3047 12.5164 6.7963 107.5444 87.9431 24.6362 0.1785 75.0566 5.4214 0.4276 0.7426 0.3085 0.0539 0.2767 2.1561 1.9081 0.7595 12.6676 0.5309 1.1175 5.5832 5.5564 0.7200 22.4297 29.7416 31.0943 16.7689 9.1208 2.7396 7.3911 15.2921 1.7518 1.5874 2.1306 1.5989 6.4478 2.5915 7.1566 21.4757 20.6559
temp: 298.150 k
press: 1.00000 atm
elementType: 16 8 8 7 6 6 6 6 6 6 6 6 6 6 6 1 1 1 1 1 1 1
symmnumber: 1
zpe: 398919.3 jmol-1
zpe.correction: 0.151940 hartree
zpe.thermalcorrener: 0.163904 hartree
zpe.thermalcorrenthalpy: 0.164848 hartree
zpe.thermalcorrgfe: 0.113514 hartree
zpe.sumelectzpe: -1025.419482 hartree
zpe.sumelectthermal: -1025.407519 hartree
zpe.sumelectthermalent: -1025.406575 hartree
zpe.sumelectthermalfe: -1025.457909 hartree
dipole: 0.9960 -9.1543 -0.0004
dipole: 9.2084
quadrupole: -69.0685 -97.6749 -104.8798
quadrupole: 6.4963 -0.0001 0.0003
quadrupole: 21.4726 -7.1338 -14.3388 6.4963 -0.0001 0.0003
hfenergy: -1025.5714228 hartree
pointgroup: C01 [X(C11H7N1O2S1)]
dipole: -0.5183562 -3.5855717 0.0001452 debye
dipolederiv: 1.0892974 0.0908845 0.0000005 0.1839467 1.4839552 -0.0000093 -0.0000039 -0.000007 1.2409867 -0.5151887 0.0105564 0.0204664 -0.0037461 -0.629035 -0.036986 0.0107313 -0.1985177 -0.6097547 -0.5151888 0.0105607 -0.0204708 -0.003747 -0.6290185 0.0369867 -0.0107324 0.1985168 -0.6097699 -0.7765185 0.2234658 -0.0000012 -0.0504601 -0.2425226 0.0000086 0.0000128 -0.0000053 -0.1439139 -0.0767473 0.1098288 -0.0000053 0.0203772 -0.1295542 -0.0000026 -0.0000039 -0.0000047 -0.2320816 -0.1084592 -0.0513804 0.0000044 -0.0222904 -0.0502706 0.0000033 0.0000028 0.0000039 0.0526702 0.2411842 0.0534528 -0.0000038 0.2242191 -0.2946009 0.0000069 -0.0000057 0.0000076 0.0839628 0.4505463 -0.2647572 -0.0000003 -0.3102248 0.1473407 -0.0000033 -0.0000103 -0.0000019 -0.1640275 -0.1222979 -0.0778357 0.0000037 -0.304271 -0.0257645 0.0000023 0.0000128 -0.0000018 -0.056916 -0.0554465 -0.0678486 0.0000006 -0.0463294 0.0392696 -0.0000052 -0.0000004 -0.0000048 -0.1287879 0.0364039 -0.0346448 -0.0000038 0.1024157 0.1199378 -0.0000116 -0.0000081 -0.0000087 -0.097931 0.0618091 -0.0497615 -0.0000019 0.0402731 0.0087367 -0.0000048 -0.0000056 -0.0000037 -0.1329003 0.0171593 0.1356802 -0.0000067 0.1594996 0.0353945 -0.0000086 -0.0000077 -0.0000074 -0.1270551 -0.1407732 -0.0656716 0.0000065 -0.2476267 -0.0017034 -0.0000036 0.0000106 -0.0000079 -0.0873247 0.3484481 -0.0491306 0.0000005 0.1989097 0.1218582 -0.0000115 0.0000231 -0.000001 -0.0553164 0.0971588 0.0008077 0.0000008 0.0574857 0.0157816 0.000004 -0.0000017 0.0000052 0.1485005 0.0581389 0.0801407 -0.000001 0.036715 -0.0610464 0.0000066 0.0000003 0.0000063 0.1521759 0.0656485 -0.0742338 0.0000038 -0.0391504 -0.0431224 0.0000088 0.0000034 0.0000123 0.1433643 -0.0994088 0.0090803 0.0000041 0.0083089 0.0802894 0.0000027 0.0000047 0.0000029 0.1623728 0.0003556 -0.0891644 0.0000057 -0.1090939 -0.0219972 0.0000079 0.0000061 0.0000071 0.1571681 0.0208909 0.0793786 -0.0000018 0.1162222 -0.0102485 0.0000065 -0.0000052 0.0000088 0.1567368 -0.0770119 0.0205922 -0.0000001 -0.0114329 0.0863205 0.000002 -0.000023 0.0000011 0.1478409 unknown
polarizability: 221.3667978|-5.1021528|168.979099|-0.0022932|-0.0031108|78.1941362 unknown
InChI: InChI=1S/C11H7NO2S/c13-15(14)10-6-2-1-4-8(10)9-5-3-7-12-11(9)15/h1-7H
charge 0 multiplicity 1
22 atoms
S  0.055835 1.894617 0.000255
O  0.037838 2.715557 1.409022
O  0.037795 2.715461 -1.408565
N  2.686067 0.703191 0.000249
C  -1.304695 0.552636 0.00032
C  -0.749027 -0.747236 0.000355
C  0.728355 -0.792879 0.000334
C  1.384741 0.460909 0.000282
C  -2.6742 0.81945 0.000333
C  -1.639864 -1.846828 0.000405
C  1.584521 -1.920567 0.000357
C  -3.552055 -0.294236 0.000385
C  -3.033171 -1.611864 0.000423
C  2.984083 -1.7139 0.000338
C  3.5044 -0.398127 0.000253
H  -3.057062 1.844321 0.000301
H  -1.258167 -2.873229 0.000433
H  1.175279 -2.935814 0.000408
H  -4.634627 -0.132773 0.000398
H  -3.722499 -2.462495 0.000464
H  3.670616 -2.56521 0.000382
H  4.580936 -0.203882 0.000266
