program: Gaussian 09
title: 000289920
version: EM64L-G09RevD.01
frameworkgroup: C1[X(C13H14N2OS2)]
method: RPBEPBE
basis: SDD
operation: Freq
keyword: #p
keyword: freq=noraman
keyword: PBEPBE/SDD
title: #p freq=noraman PBEPBE/SDD
converged: YES YES NO NO
title: Mulliken charges:
elementType: S S O N N C C C C C C C C C C C C C H H H H H H H H H H H H H H
charge: -0.057167 0.320157 -0.236802 -0.035841 0.065943 -0.373876 -0.357194 -0.300823 -0.301925 -0.235574 -0.600438 0.514808 -0.437349 0.575048 -0.565167 -0.607672 -0.265551 -0.518925 0.245941 0.244691 0.234425 0.259637 0.230508 0.195406 0.207716 0.230323 0.286809 0.217490 0.285739 0.253026 0.259976 0.266659
chargesum: 0.00000
title: Mulliken charges with hydrogens summed into heavy atoms:
elementType: S S O N N C C C C C C C C C C C C C
charge: -0.057167 0.320157 -0.236802 -0.035841 0.065943 0.116757 0.136868 0.125092 0.136114 -0.235574 -0.096140 0.514808 -0.151610 0.575048 -0.312140 -0.607672 -0.005575 -0.252265
polarizability: 2.36257968e+02 -1.23681647e+01 1.86299624e+02 -2.41352380e+01 -1.62721411e+01 1.43653608e+02
1716.lowfreq: -10.8043 -0.0026 -0.0025 -0.0019 0.9579 5.0389 15.7766 28.5397 49.0734
frequency: 15.0675 28.5175 49.0616 52.2243 78.2280 114.1601 171.3550 201.0259 205.5468 274.6132 285.5817 304.6493 353.8128 374.1077 391.2540 415.6810 424.8077 440.8096 457.9228 475.5825 486.7729 530.6524 542.3007 578.4029 605.1653 647.4906 656.8916 700.2160 716.0957 733.1030 788.6113 792.6405 801.5787 823.0110 832.5908 889.4019 900.5247 905.7647 943.5350 957.1543 965.8345 1009.8643 1022.5712 1045.1782 1050.8047 1069.7656 1094.4348 1097.7261 1110.1408 1150.7797 1166.8165 1186.8552 1203.1945 1211.0292 1248.8578 1254.2487 1260.0554 1274.2550 1294.1627 1323.6706 1324.6943 1338.1315 1345.5388 1353.8878 1366.0847 1379.0817 1427.5002 1441.4650 1443.6536 1447.9305 1455.1877 1465.2574 1486.4018 1491.4329 1542.3136 1589.3063 2949.4131 2964.2668 2987.8615 2989.5663 2996.0351 3064.3549 3068.8349 3085.1035 3093.9233 3112.0718 3122.2954 3130.6559 3173.4220 3230.1954
redmass: 6.1404 6.1165 5.6512 4.0708 5.2722 8.0314 2.8551 4.4602 6.6883 3.5453 3.3101 4.9882 3.6132 5.2068 2.8699 2.2744 4.1769 4.2266 2.6733 4.0326 4.6755 8.2768 7.4758 2.5044 2.6774 7.4386 4.3074 2.2047 4.7420 3.2415 2.8097 4.3426 4.3204 1.7759 2.8985 1.3322 2.2469 1.6145 1.7186 2.6069 2.1964 2.4131 2.3443 2.2263 3.3270 3.6896 1.9951 1.6409 2.8246 1.7140 1.6037 1.1295 1.8454 2.9663 1.4283 1.5092 1.6024 1.2261 1.3783 1.9258 1.2959 1.2406 1.3892 3.7500 1.2642 3.8280 3.0677 1.4711 1.0984 1.0894 1.1002 1.4923 1.3490 4.9949 6.6104 6.4184 1.0682 1.0678 1.0610 1.0658 1.0684 1.1015 1.0944 1.0963 1.0982 1.0914 1.0927 1.0934 1.0923 1.0998
irintensity: 0.7844 2.5215 4.4998 1.1461 1.1774 0.3867 4.7500 1.4017 0.7773 4.3743 12.7864 7.4458 1.8649 2.1298 3.4756 0.8987 0.7684 0.9885 0.3463 2.4378 14.3072 1.2056 2.6502 7.9804 7.4653 1.7069 0.8957 27.1715 24.7724 35.3023 9.4584 21.3550 7.5592 0.0728 7.3990 4.3508 3.2712 33.7306 15.8614 1.6614 9.7851 8.3488 35.7443 44.3778 29.6258 33.7994 20.6544 32.4716 4.7584 17.3711 17.4721 4.1669 15.6100 14.2769 38.9628 38.3005 47.4715 21.9787 23.0393 3.5882 2.8154 1.2948 4.9526 0.8257 0.4015 102.4202 16.4087 108.6247 8.0192 2.6554 5.6233 92.4489 37.0399 9.2160 2.9341 0.9576 49.1731 51.8476 31.3005 23.1931 38.6090 17.8737 3.2322 27.4882 26.8633 23.5539 10.5299 0.3868 3.2275 0.9820
temp: 298.150 k
press: 1.00000 atm
elementType: 16 16 8 7 7 6 6 6 6 6 6 6 6 6 6 6 6 6 1 1 1 1 1 1 1 1 1 1 1 1 1 1
symmnumber: 1
zpe: 651079.7 jmol-1
zpe.correction: 0.247983 hartree
zpe.thermalcorrener: 0.263874 hartree
zpe.thermalcorrenthalpy: 0.264818 hartree
zpe.thermalcorrgfe: 0.201820 hartree
zpe.sumelectzpe: -1483.299058 hartree
zpe.sumelectthermal: -1483.283167 hartree
zpe.sumelectthermalent: -1483.282223 hartree
zpe.sumelectthermalfe: -1483.345221 hartree
dipole: -0.8533 -0.9572 -1.0129
dipole: 1.6341
quadrupole: -122.1778 -132.9361 -115.6994
quadrupole: 10.7416 -10.1267 -7.2287
quadrupole: 1.4266 -9.3316 7.9050 10.7416 -10.1267 -7.2287
hfenergy: -1483.547041 hartree
pointgroup: C01 [X(C13H14N2O1S2)]
dipole: -0.3723921 -0.3386937 -0.3999333 debye
polarizability: 233.2261235|-21.1500943|190.2748726|-19.5098943|-16.4496959|142.7102044 unknown
InChI: InChI=1S/C13H14N2OS2/c17-12(15-2-4-16-5-3-15)8-10-7-11-1-6-18-13(11)14-9-10/h1,6-7,9H,2-5,8H2
charge 0 multiplicity 1
32 atoms
S  -1.612856 3.145614 0.189696
S  4.454697 -1.748172 0.194024
O  -4.555929 -1.105823 -0.963293
N  -2.295823 0.520227 -0.162231
N  2.084211 -1.59073 1.665009
C  -2.315488 -0.942067 0.102985
C  -3.103274 0.876653 -1.357743
C  -3.774832 -1.432084 0.235946
C  -4.540581 0.35171 -1.193339
C  -1.613141 1.461816 0.568759
C  -0.770994 0.976959 1.754105
C  0.53333 0.29466 1.336281
C  1.386323 0.864843 0.364784
C  2.597155 0.203554 0.036393
C  0.930116 -0.926883 1.954996
C  2.872084 -1.023265 0.731379
C  3.639018 0.555818 -0.906213
C  4.670471 -0.358867 -0.940606
H  -1.74523 -1.188263 1.009128
H  -1.833564 -1.457163 -0.751422
H  -2.633195 0.41428 -2.247826
H  -3.084818 1.974685 -1.468053
H  -3.806386 -2.530541 0.322861
H  -4.24509 -0.97548 1.134291
H  -5.038971 0.872399 -0.348199
H  -5.120734 0.509481 -2.116447
H  -0.540699 1.877014 2.347747
H  -1.349188 0.300712 2.414034
H  1.108272 1.806516 -0.123014
H  0.297183 -1.389305 2.723521
H  3.613894 1.454397 -1.52777
H  5.569341 -0.332997 -1.555485
