program: Gaussian 09
title: 000289919
version: EM64L-G09RevD.01
frameworkgroup: C1[X(C9H7NOS)]
method: RPBEPBE
basis: SDD
operation: Freq
keyword: #p
keyword: freq=noraman
keyword: PBEPBE/SDD
title: #p freq=noraman PBEPBE/SDD
converged: NO YES NO NO
title: Mulliken charges:
elementType: S O N C C C C C C C C C H H H H H H H
charge: 0.374632 -0.208973 0.063956 0.579103 -0.208979 -0.577189 -0.377358 -0.332914 0.224134 -0.157737 -0.365007 -0.767008 0.267569 0.253564 0.235024 0.249567 0.240928 0.240874 0.265812
chargesum: 0.00000
title: Mulliken charges with hydrogens summed into heavy atoms:
elementType: S O N C C C C C C C C C
charge: 0.374632 -0.208973 0.063956 0.579103 -0.208979 -0.577189 -0.109789 -0.079350 0.224134 0.077288 -0.115440 -0.019394
polarizability: 2.06035957e+02 -8.56632097e+00 1.22971277e+02 -1.19069838e-02 3.88342039e-03 5.12551211e+01
1716.lowfreq: -0.0001 0.0004 0.0013 7.0383 7.4406 12.1929 71.3144 88.3955 95.4590
frequency: 71.3082 88.3930 95.4473 136.0957 187.8873 262.4313 299.1935 337.9053 424.3700 427.2253 462.7293 472.3224 552.6963 559.3766 609.4795 616.3765 659.4099 695.3276 757.8457 797.7338 843.2641 871.1935 910.5888 934.6953 982.1109 1006.1483 1024.4738 1033.5019 1074.4397 1123.0738 1189.8449 1239.2525 1259.6170 1311.7354 1350.9255 1368.7185 1378.5553 1436.3873 1447.3388 1459.1520 1501.4049 1554.6101 1575.7895 1586.7521 2989.1454 3076.1209 3128.7276 3139.2164 3145.7947 3168.5070 3175.4655
redmass: 3.2318 6.0042 1.1464 5.3322 5.8296 5.2036 4.7628 7.2840 7.2545 4.4769 3.9330 8.7945 4.9181 3.1633 5.2325 2.8979 5.8084 8.0001 3.1496 1.3564 6.5337 1.5436 3.7951 1.4270 1.3860 2.0474 1.7541 2.4753 4.1192 1.4888 1.3626 1.9115 5.1956 2.7261 6.5228 1.2440 2.4337 2.3959 1.0910 1.0490 5.9811 6.3383 7.1031 7.2314 1.0369 1.0975 1.0996 1.0880 1.0927 1.0946 1.0992
irintensity: 2.2674 0.0326 0.0178 3.4000 2.8354 2.5126 0.0646 7.5665 1.0950 0.4823 5.4833 4.4993 22.0869 0.0563 6.1016 6.0920 0.2799 1.3968 21.1773 20.5892 6.0332 48.2919 21.1410 1.6547 1.1626 10.2787 3.8005 2.5676 16.0129 2.6685 86.0981 0.4777 151.2784 4.8413 26.4422 51.3334 13.5122 5.9096 26.4383 21.4742 111.3500 10.3814 164.7885 53.2746 3.4095 11.2717 12.6700 1.7476 13.1850 4.8638 23.4609
temp: 298.150 k
press: 1.00000 atm
elementType: 16 8 7 6 6 6 6 6 6 6 6 6 1 1 1 1 1 1 1
symmnumber: 1
zpe: 357684.1 jmol-1
zpe.correction: 0.136235 hartree
zpe.thermalcorrener: 0.146567 hartree
zpe.thermalcorrenthalpy: 0.147511 hartree
zpe.thermalcorrgfe: 0.099651 hartree
zpe.sumelectzpe: -874.350017 hartree
zpe.sumelectthermal: -874.339685 hartree
zpe.sumelectthermalent: -874.338741 hartree
zpe.sumelectthermalfe: -874.386601 hartree
dipole: -2.3035 5.8702 0.0006
dipole: 6.3060
quadrupole: -72.9103 -75.2466 -78.8318
quadrupole: 4.6424 0.0000 0.0003
quadrupole: 2.7526 0.4163 -3.1689 4.6424 0.0000 0.0003
hfenergy: -874.4862519 hartree
pointgroup: C01 [X(C9H7N1O1S1)]
dipole: 0.9113535 -2.3075207 0.0002223 debye
dipolederiv: -0.2143239 -0.0374863 -0.0000325 0.0516734 -0.112676 0.0000217 -0.0000476 -0.0000003 0.1262955 -1.0128325 0.1095541 -0.0000811 0.3564354 -0.6794342 0.0001237 0.0000285 -0.0000082 -0.3047473 -0.5851762 0.1289738 -0.0000411 -0.0485279 -0.3157386 -0.0000026 -0.000037 0.0000171 -0.1925684 -0.2371269 -0.146222 -0.0000183 0.2017362 -0.3076872 0.0000337 -0.0000144 -0.0000027 0.0946155 -1.0504952 0.1961288 -0.0000438 0.2585339 0.372461 -0.0000004 -0.0000918 -0.0000003 -0.130486 0.6298322 -0.1802277 0.0000811 -0.2477933 0.1421626 -0.0000304 0.0000746 -0.0000229 -0.0635781 0.2836387 0.1793732 0.0000351 -0.0789513 -0.1227059 -0.0000273 -0.0000351 0.0000258 -0.1420169 0.3104968 0.0825936 0.0000354 -0.0529667 0.1861974 -0.0000099 0.0000539 0.0000005 -0.12613 1.9228057 -0.0001127 0.0000662 -0.0033151 0.8345959 -0.0001752 -0.0000496 -0.0001301 0.1527912 -0.1504874 -0.1527096 0.0000054 -0.3539415 -0.2173836 -0.0000262 0.0000026 -0.0000123 -0.1210358 0.2491667 -0.0345403 0.0000319 0.2258171 0.37615 0.000006 0.0000211 -0.0000174 -0.0698252 -0.2016344 -0.179844 0.0000302 -0.3225285 -0.3527194 0.000166 0.0002873 0.0002941 0.0528388 0.0850654 -0.0220183 -0.0000123 -0.0945173 -0.0324145 0.0000012 -0.0000214 -0.0000035 0.1780879 0.0858775 -0.0353144 -0.0000063 0.0139431 -0.0715547 0.000007 -0.0000044 0.0000038 0.153142 -0.0621186 0.0854551 -0.0000239 0.1007058 0.0476887 0.0000128 -0.0000265 0.0000109 0.1679812 -0.0895748 -0.0521822 -0.0000193 -0.0721714 0.061482 -0.0000042 -0.0000154 -0.0000022 0.1383205 0.0707635 0.0375986 -0.0869144 0.012644 0.0517064 0.0650663 -0.0488694 0.0829446 -0.0192413 0.0707013 0.0378238 0.0870201 0.0127798 0.0515215 -0.0651891 0.0488996 -0.0830788 -0.0190009 -0.1045779 -0.0168435 -0.0001123 0.0404445 0.0883485 0.0000267 -0.0001549 -0.0000178 0.1245573 unknown
polarizability: 206.0733271|-8.3830964|122.9339065|0.0119155|-0.0038572|51.2551211 unknown
InChI: InChI=1S/C9H7NOS/c1-6(11)8-5-7-3-2-4-10-9(7)12-8/h2-5H,1H3
charge 0 multiplicity 1
19 atoms
S  -0.575711 1.646208 -0.000267
O  -3.563846 1.127823 -0.000357
N  2.195235 1.400679 0.000015
C  0.824648 -0.669335 -0.000055
C  -1.43608 0.037709 -0.000314
C  1.005663 0.758446 -0.000075
C  -0.565156 -1.046465 -0.000178
C  2.002075 -1.467124 0.000074
C  -2.917189 0.038548 -0.000457
C  3.249844 -0.817232 0.000178
C  3.301917 0.606062 0.000143
C  -3.623925 -1.314346 -0.000143
H  -0.908081 -2.084859 -0.000181
H  1.933699 -2.560426 0.000097
H  4.183458 -1.387233 0.000285
H  4.264448 1.128836 0.000216
H  -3.347127 -1.903646 0.893391
H  -3.346229 -1.904643 -0.892726
H  -4.711341 -1.147002 -0.000745
