program: Gaussian 09
title: 000289918
version: EM64L-G09RevD.01
frameworkgroup: C1[X(C14H10N2S)]
method: RPBEPBE
basis: SDD
operation: Freq
keyword: #p
keyword: freq=noraman
keyword: PBEPBE/SDD
title: #p freq=noraman PBEPBE/SDD
converged: YES YES NO NO
title: Mulliken charges:
elementType: S N N C C C C C C C C C C C C C C H H H H H H H H H H
charge: 0.324396 0.068908 -0.073778 0.591084 -0.596635 -0.419408 0.268412 -0.269257 -0.482405 0.433302 -0.522073 -0.375396 -0.367373 -0.370630 -0.231421 -0.219595 -0.227959 0.264056 0.254135 0.266716 0.265616 0.217813 0.228302 0.276859 0.231364 0.232043 0.232924
chargesum: 0.00000
title: Mulliken charges with hydrogens summed into heavy atoms:
elementType: S N N C C C C C C C C C C C C C C
charge: 0.324396 0.068908 -0.073778 0.591084 -0.596635 -0.155352 0.268412 -0.015122 -0.215689 0.433302 -0.256456 -0.157583 -0.139071 -0.093771 -0.000057 0.012449 0.004965
polarizability: 3.90614868e+02 3.57791921e+00 1.65176081e+02 -1.40339277e+00 -4.23261601e+00 8.00715210e+01
1716.lowfreq: -4.5104 -0.0016 -0.0011 0.0012 1.3643 3.7242 34.1004 40.7939 50.5066
frequency: 34.0349 40.7854 50.4991 110.3258 146.0554 182.8043 202.9338 253.8701 272.9238 340.4137 383.4049 405.2010 426.1220 431.0352 473.5382 500.3893 515.2244 536.7169 579.2668 613.8110 623.3931 651.4306 684.0642 698.4317 712.3522 727.4577 772.6413 776.7462 804.7449 846.0359 858.2589 882.0905 905.9490 913.4315 932.8714 961.2092 985.7382 988.3007 990.6404 1008.7654 1021.6909 1046.9152 1080.8680 1096.6175 1151.4390 1173.0293 1180.3040 1205.0682 1233.4661 1254.6847 1304.7968 1315.7772 1332.6752 1361.3541 1382.9938 1396.7571 1420.2425 1442.4826 1478.3595 1488.3265 1530.7998 1571.1786 1581.9953 1607.4119 1616.7307 2940.1022 3118.2594 3131.7509 3137.1875 3145.2298 3157.1378 3159.0335 3169.7278 3170.6827 3229.8035
redmass: 4.1347 7.2746 5.5991 5.5579 5.5377 7.7090 4.1604 5.1799 3.3704 5.8069 5.4014 2.8381 7.0356 5.1774 3.7881 4.8977 4.0863 7.5392 7.0173 6.1121 3.0144 7.4188 6.4506 1.7934 1.7266 8.1971 1.7290 2.4971 5.0534 3.8861 1.2498 1.3611 1.6454 1.4570 1.3969 3.5790 1.5392 5.3714 1.5302 1.3591 2.1414 3.3108 1.5617 1.2882 2.0755 1.0673 1.1140 2.9788 1.8696 1.6754 1.5062 1.6171 5.8295 1.8012 4.6073 4.5117 3.5627 2.3058 3.1764 3.7763 6.4373 6.7236 6.4142 6.0196 6.6471 1.0861 1.0878 1.0869 1.0921 1.0918 1.0924 1.0959 1.1006 1.0923 1.0996
irintensity: 0.9161 0.0369 0.4142 0.1424 1.8293 1.0542 0.6903 5.5080 12.8455 7.0704 6.3595 0.1742 3.7085 7.8297 12.5742 5.0808 6.7937 2.6945 8.3188 0.2720 4.5627 2.1331 12.2450 39.3507 80.5846 11.3367 39.1671 9.7412 16.8519 18.6837 0.3446 5.8708 37.2095 7.8095 3.3610 2.9194 12.1693 0.8119 6.7431 2.7762 7.9125 26.4373 9.6083 27.1049 65.7176 1.4028 8.4517 2.6767 25.8113 5.3965 3.0861 18.6824 2.9429 21.8920 49.7094 5.7844 15.8122 24.1222 6.1549 15.2765 1.3677 38.9061 20.1680 67.3605 45.8877 51.2802 7.5525 0.0885 5.8109 20.5518 5.0177 23.1142 30.7318 4.5707 1.0996
temp: 298.150 k
press: 1.00000 atm
elementType: 16 7 7 6 6 6 6 6 6 6 6 6 6 6 6 6 6 1 1 1 1 1 1 1 1 1 1
symmnumber: 1
zpe: 525512.3 jmol-1
zpe.correction: 0.200157 hartree
zpe.thermalcorrener: 0.213584 hartree
zpe.thermalcorrenthalpy: 0.214529 hartree
zpe.thermalcorrgfe: 0.158341 hartree
zpe.sumelectzpe: -1045.879624 hartree
zpe.sumelectthermal: -1045.866197 hartree
zpe.sumelectthermalent: -1045.865253 hartree
zpe.sumelectthermalfe: -1045.921441 hartree
dipole: -2.7572 3.9610 0.2759
dipole: 4.8340
quadrupole: -90.0061 -99.4902 -109.9784
quadrupole: 9.5906 2.6203 -2.2458
quadrupole: 9.8188 0.3347 -10.1535 9.5906 2.6203 -2.2458
hfenergy: -1046.0797814 hartree
pointgroup: C01 [X(C14H10N2S1)]
dipole: 1.0418745 -1.4489103 -0.6573999 debye
polarizability: 390.6372099|-1.5811871|142.9944957|-2.7348514|37.5765187|102.2307644 unknown
InChI: InChI=1S/C14H10N2S/c1-2-4-11(5-3-1)9-15-13-8-12-6-7-17-14(12)16-10-13/h1-10H
charge 0 multiplicity 1
27 atoms
S  -5.379832 0.55322 0.19076
N  -2.902581 1.787044 0.577279
N  0.591682 0.563486 0.442347
C  -2.959643 -0.620874 -0.010413
C  -3.56337 0.651444 0.267044
C  -1.543667 -0.677824 0.027135
C  -0.817781 0.503286 0.334545
C  -3.938314 -1.655086 -0.278548
C  -1.549276 1.703754 0.618876
C  2.83436 -0.132889 -0.216695
C  -5.239041 -1.2007 -0.215968
C  1.370428 -0.115466 -0.364842
C  3.620859 -0.87364 -1.141406
C  3.480285 0.575698 0.836146
C  5.02599 -0.908422 -1.018497
C  4.8822 0.539874 0.955885
C  5.659733 -0.201886 0.030289
H  -1.020066 -1.625897 -0.141076
H  -3.678325 -2.691012 -0.510956
H  -0.998413 2.612416 0.880557
H  -6.155551 -1.766154 -0.379713
H  0.963017 -0.698584 -1.219787
H  3.126785 -1.419606 -1.955307
H  2.85881 1.141004 1.537976
H  5.625233 -1.480882 -1.734734
H  5.375894 1.086804 1.766691
H  6.750885 -0.227309 0.12711
